Acetylpyrazine

Normal alkane RI, non-polar column, temperature ramp

Data compiled by: NIST Mass Spectrometry Data Center, William E. Wallace, director

Column type CapillaryCapillaryCapillaryCapillaryCapillary
Active phase SLB-5MSDB-5MSDB-1DB-1DB-1
Column length (m) 10.30.60.60.60.
Carrier gas HeliumHeHeHeHe
Substrate
Column diameter (mm) 0.180.530.320.320.32
Phase thickness (μm) 0.181.51.1.01.
Tstart (C) 40.40.40.40.40.
Tend (C) 295.225.260.260.260.
Heat rate (K/min) 10.6.2.2.3.
Initial hold (min) 1.55.
Final hold (min)  30.
I 1036.1029.1000.998.1003.
ReferenceRisticevic, Carasek, et al., 2008Cadwallader and Heo, 2001Chen and Ho, 1999Chen and Ho, 1998Chen, Wang, et al., 1998
Comment MSDC-RI MSDC-RI MSDC-RI MSDC-RI MSDC-RI
Column type PackedCapillaryCapillary
Active phase SE-54OV-101OV-101
Column length (m) 3.50.50.
Carrier gas  N2N2
Substrate Chromosorb G AW DMCS (100-120 mesh)
Column diameter (mm)  0.220.22
Phase thickness (μm)
Tstart (C) 50.80.80.
Tend (C) 230.200.200.
Heat rate (K/min) 6.2.2.
Initial hold (min) 2.
Final hold (min) 10.
I 1023.993.993.
ReferenceSchieberle, 1991Mihara and Masuda, 1987Mihara and Enomoto, 1985
Comment MSDC-RI MSDC-RI MSDC-RI

Van Den Dool and Kratz RI, non-polar column, custom temperature program

Data compiled by: NIST Mass Spectrometry Data Center, William E. Wallace, director

Column type CapillaryCapillaryCapillaryCapillaryCapillary
Active phase DB-5SPB-5DB-5DB-5SE-54
Column length (m)  30. 30.30.
Carrier gas    HeHe
Substrate
Column diameter (mm)  0.53 0.250.32
Phase thickness (μm)  1.5 0.250.25
Program not specified40C(1min) => 6C/min => 180C => 20C/min => 280Cnot specified40C(1min) => 6C/min => 180C => 20C/min => 280C40C (2min) => 40C/min => 50C (2min) => 240C (10min)
I 1021.1025.1022.1023.1022.
ReferenceEscudero, Campo, et al., 2007Majcher and Jelen, 2007Campo, Ferreira, et al., 2005Majcher and Jelén, 2005Münch, Hofmann, et al., 1997
Comment MSDC-RI MSDC-RI MSDC-RI MSDC-RI MSDC-RI

Van Den Dool and Kratz RI, polar column, custom temperature program

Data compiled by: NIST Mass Spectrometry Data Center, William E. Wallace, director

Column type CapillaryCapillaryCapillaryCapillaryCapillary
Active phase Supelcowax-10DB-WaxSupelcowax-10DB-WaxSupelcowax-10
Column length (m) 30.30.30.30.30.
Carrier gas HeH2 H2He
Substrate
Column diameter (mm) 0.250.320.250.320.25
Phase thickness (μm) 0.250.50.250.50.25
Program 35C(8min) => 4C/min => 60C => 6C/min => 160C => 20C/min => 200C(1min)40C(5min) => 4C/min => 100C6C/min => 136C => 3C/min => 220C (10min)40C(2min) => 40C/min => 60C(2min) => 5C/min => 240C40C(5min) => 4C/min => 100C => 6C/min => 200C40C(2min) => 40C/min => 60(2min)C => 5C/min => 240C
I 1639.1632.1604.1636.1604.
ReferenceBianchi, Careri, et al., 2007Escudero, Campo, et al., 2007Majcher and Jelen, 2007Campo, Ferreira, et al., 2005Majcher and Jelén, 2005
Comment MSDC-RI MSDC-RI MSDC-RI MSDC-RI MSDC-RI
Column type CapillaryCapillaryCapillaryCapillary
Active phase DB-WaxDB-WaxDB-WaxFFAP
Column length (m) 30.30.30.30.
Carrier gas HeHeHeHe
Substrate
Column diameter (mm) 0.320.320.320.32
Phase thickness (μm) 0.50.50.50.25
Program 50C => 6C/min => 70C => 4C/min => 150C => 10C/min => 250C50C => 6C/min => 70C => 4C/min => 150C => 10C/min => 250C50C => 5C/min => 180C => 10C/min => 250C40C (2min) => 40C/min => 60C (2min) => 240C (10min)
I 1647.1647.1656.1608.
ReferencePennarun, Prost, et al., 2003Pennarun, Prost, et al., 2002Sérot, Regost, et al., 2001Münch, Hofmann, et al., 1997
Comment MSDC-RI MSDC-RI MSDC-RI MSDC-RI

Van Den Dool and Kratz RI, non-polar column, temperature ramp

Data compiled by: NIST Mass Spectrometry Data Center, William E. Wallace, director

Column type CapillaryCapillaryCapillary
Active phase DB-1DB-5MSSE-30
Column length (m) 60.30.50.
Carrier gas He
Substrate
Column diameter (mm) 0.320.320.32
Phase thickness (μm) 1.0.250.25
Tstart (C) 40.40.50.
Tend (C) 220.200.240.
Heat rate (K/min) 2.6.4.
Initial hold (min) 5.5.
Final hold (min)  30.
I 987.1031.998.
ReferenceKim, 2001Cha and Cadwallader, 1998Misharina, Golovnya, et al., 1991
Comment MSDC-RI MSDC-RI MSDC-RI

References

Risticevic, Carasek, et al., 2008
Risticevic, S.; Carasek, E.; Pawliszyn, J., Headspace solid-phase microextraction-gas chromatographic-time-of-flight mass spectrometric methodology for geographical origin verification of coffee, Anal. Chim. Acta, 2008, 617, 1-2, 72-84, https://doi.org/10.1016/j.aca.2008.04.009 . [all data]

Cadwallader and Heo, 2001
Cadwallader, K.R.; Heo, J., Aroma of roasted sesame oil: characterization by direct thermal desorption-gas chromatography-olfactometry and sample dilution analysis, Am. Chem. Soc. Symp. Ser., 2001, 782, 187-202. [all data]

Chen and Ho, 1999
Chen, J.; Ho, C.-T., Comparison of volatile generation in serine/threonine/glutamine-ribose/glucose/fructose model systems, J. Agric. Food Chem., 1999, 47, 2, 643-647, https://doi.org/10.1021/jf980771a . [all data]

Chen and Ho, 1998
Chen, J.; Ho, C.-T., Volatile compounds generated in serine-monosaccharide model systems, J. Agric. Food Chem., 1998, 46, 4, 1518-1522, https://doi.org/10.1021/jf970934f . [all data]

Chen, Wang, et al., 1998
Chen, J.; Wang, M.; Ho, C.-T., Volatile compounds generated from thermal degradation of N-acetylglucosamine, J. Agric. Food Chem., 1998, 46, 8, 3207-3209, https://doi.org/10.1021/jf980129g . [all data]

Schieberle, 1991
Schieberle, P., Primary odorants in popcorn, J. Agric. Food Chem., 1991, 39, 6, 1141-1144, https://doi.org/10.1021/jf00006a030 . [all data]

Mihara and Masuda, 1987
Mihara, S.; Masuda, H., Correlation between molecular structures and retention indices of pyrazines, J. Chromatogr., 1987, 402, 309-317, https://doi.org/10.1016/0021-9673(87)80029-8 . [all data]

Mihara and Enomoto, 1985
Mihara, S.; Enomoto, N., Calculation of retention indices of pyrazines on the basis of molecular structure, J. Chromatogr., 1985, 324, 428-430, https://doi.org/10.1016/S0021-9673(01)81342-X . [all data]