Pentaborane(9),2,3-μ-silyl-

Gas phase ion energetics data

Data compiled by: Sharon G. Lias, Rhoda D. Levin, and Sherif A. Kafafi

Ionization energy determinations

IE (eV) Method Reference Comment
10.17PEUlman and Fehlner, 1976Vertical value

References

Ulman and Fehlner, 1976
Ulman, J.A.; Fehlner, T.P., Substituent effects in cluster species. Photoelectron spectra of 1-,2-, μ-substituted pentaborane(9), J. Am. Chem. Soc., 1976, 98, 1119. [all data]