1-Nonen-3-ol

Van Den Dool and Kratz RI, non-polar column, temperature ramp

Data compiled by: NIST Mass Spectrometry Data Center, William E. Wallace, director

Column type CapillaryCapillaryCapillary
Active phase CP Sil 5 CBCP Sil 5 CBDB-1
Column length (m) 25.25.30.
Carrier gas H2HeHe
Substrate
Column diameter (mm) 0.250.250.25
Phase thickness (μm)  0.40.25
Tstart (C) 80.80.40.
Tend (C) 270.270.250.
Heat rate (K/min) 10.10.2.
Initial hold (min)   5.
Final hold (min)   20.
I 1058.1058.1064.
ReferenceZiegenbein, Hanssen, et al., 2006Ziegenbein, Hanssen, et al., 2006, 2de Feo, Bruno, et al., 2003
Comment MSDC-RI MSDC-RI MSDC-RI

Kovats' RI, non-polar column, custom temperature program

Data compiled by: NIST Mass Spectrometry Data Center, William E. Wallace, director

Column type Capillary
Active phase OV-1
Column length (m) 15.
Carrier gas He
Substrate
Column diameter (mm) 0.317
Phase thickness (μm) 0.25
Program 50C(4min) => (4C/min) => 90C => (10C/min)=300C(10min)
I 1072.
ReferenceEl-Shazly, Dorai, et al., 2002
Comment MSDC-RI

Normal alkane RI, polar column, custom temperature program

Data compiled by: NIST Mass Spectrometry Data Center, William E. Wallace, director

Column type Capillary
Active phase Carbowax 20M
Column length (m)
Carrier gas
Substrate
Column diameter (mm)
Phase thickness (μm)
Program not specified
I 1560.
ReferenceVinogradov, 2004
Comment MSDC-RI

References

Ziegenbein, Hanssen, et al., 2006
Ziegenbein, F.C.; Hanssen, H.-P.; König, W.A., Secondary metabolites from Ganoderma lucidum and Spongiporus leucomallellus, Phytochemistry, 2006, 67, 2, 202-211, https://doi.org/10.1016/j.phytochem.2005.10.025 . [all data]

Ziegenbein, Hanssen, et al., 2006, 2
Ziegenbein, F.C.; Hanssen, H.-P.; König, W.A., Chemical constituents of the essential oils of three wood-rotting fungi, Flavour Fragr. J., 2006, 21, 5, 813-816, https://doi.org/10.1002/ffj.1732 . [all data]

de Feo, Bruno, et al., 2003
de Feo, V.; Bruno, M.; Tahiri, B.; Napolitano, F.; Senatore, F., Chemical composition and antibacterial activity of essential oils from Thymus spinulosus Ten. (Lamiaceae), J. Agric. Food Chem., 2003, 51, 13, 3849-3853, https://doi.org/10.1021/jf021232f . [all data]