3,4-Dioxymethylenebenzyliden-5,6,7,8-tetrahydronaphthyl-2-acetonitrile

Condensed phase thermochemistry data

Data compiled by: Hussein Y. Afeefy, Joel F. Liebman, and Stephen E. Stein

Quantity Value Units Method Reference Comment
Δfsolid7.1kcal/molCcbZavoianu, Ciocazanu, et al., 1986
Quantity Value Units Method Reference Comment
Δcsolid-2468.8kcal/molCcbZavoianu, Ciocazanu, et al., 1986

References

Zavoianu, Ciocazanu, et al., 1986
Zavoianu, D.; Ciocazanu, I.; Moga-Gheorghe, S.; Bornaz, C., Structura si reactivitatea nitrililor, Rev. Chim. (Bucharest), 1986, 37, 960-962. [all data]