Disulfide, methyl propyl

Normal alkane RI, polar column, temperature ramp

Data compiled by: NIST Mass Spectrometry Data Center, William E. Wallace, director

Column type CapillaryCapillaryCapillary
Active phase Supelcowax-10DB-WaxCP-Wax 52CB
Column length (m) 10.60.50.
Carrier gas He He
Substrate
Column diameter (mm) 0.10.320.32
Phase thickness (μm) 0.10.250.25
Tstart (C) 40.50.50.
Tend (C) 240.210.210.
Heat rate (K/min) 50.1.51.5
Initial hold (min) 1.55.5.
Final hold (min) 2.10.10.
I 1215.1243.1252.
ReferenceChin, Nazimah, et al., 2007Chyau and Mau, 2001Chyau, Lin, et al., 1997
Comment MSDC-RI MSDC-RI MSDC-RI

Phase change data

Data compiled by: Robert L. Brown and Stephen E. Stein

Reduced pressure boiling point

Tboil (K) Pressure (bar) Reference
343.20.057Aldrich Chemical Company Inc., 1990

Van Den Dool and Kratz RI, non-polar column, temperature ramp

Data compiled by: NIST Mass Spectrometry Data Center, William E. Wallace, director

Column type CapillaryCapillaryCapillaryCapillaryCapillary
Active phase DB-5BPX-5DB-1DB-1Ultra-1
Column length (m) 30.50.30.60.25.
Carrier gas HeHeHeHeH2
Substrate
Column diameter (mm) 0.320.320.320.250.2
Phase thickness (μm) 0.50.25 1.00.33
Tstart (C) 40.35.60.40.60.
Tend (C) 265.250.250.260.230.
Heat rate (K/min) 7.4.4.2.2.
Initial hold (min)  3.4.5.
Final hold (min) 5.10. 60.
I 946.940.914.920.909.7
ReferenceMahattanatawee K., Perez-Cacho P.R., et al., 2007Oruna-Concha, Duckham, et al., 2001Pino, Fuentes, et al., 2001Yu, Lin, et al., 1994Farkas, Hradský, et al., 1992
Comment MSDC-RI MSDC-RI MSDC-RI MSDC-RI MSDC-RI
Column type CapillaryCapillaryCapillaryCapillaryCapillary
Active phase HP-1HP-1OV-101OV-1OV-1
Column length (m) 50.50.50.183.183.
Carrier gas HeHeHe N2
Substrate
Column diameter (mm) 0.320.320.320.762
Phase thickness (μm) 1.051.05
Tstart (C) 40.40.50.0.0.
Tend (C) 260.260.250.230.230.
Heat rate (K/min) 2.2.4.1.1.
Initial hold (min)
Final hold (min)
I 912.915.914.914.914.
ReferenceKuo and Ho, 1992Kuo and Ho, 1992, 2Misharina and Golovnya, 1989Schreyen, Dirinck, et al., 1976Schreyen, Dirinck, et al., 1976, 2
Comment MSDC-RI MSDC-RI MSDC-RI MSDC-RI MSDC-RI
Column type Capillary
Active phase OV-1
Column length (m) 183.
Carrier gas N2
Substrate
Column diameter (mm)
Phase thickness (μm)
Tstart (C) 0.
Tend (C) 230.
Heat rate (K/min) 1.
Initial hold (min)
Final hold (min)
I 922.
ReferenceSchreyen, Dirinck, et al., 1976, 2
Comment MSDC-RI

Normal alkane RI, non-polar column, custom temperature program

Data compiled by: NIST Mass Spectrometry Data Center, William E. Wallace, director

Column type CapillaryCapillaryCapillaryCapillaryCapillary
Active phase HP-5 MSHP-5HP-5 MSSE-30SE-30
Column length (m) 30.60.30.
Carrier gas HeliumHelium
Substrate
Column diameter (mm) 0.250.250.25
Phase thickness (μm) 0.250.250.25
Program 40 0C (5 min) 30 0C/min -> 60 0C 6 0C/min -> 230 0C (10 min)30 0C (2 min) 2 0Cmin -> 60 0C 10 0C/min -> 100 0C 20 0C/min -> 140 0C 10 0C/min -> 200 0C (10 min)40 0C (3 min) 2 0C/min -> 150 0C 20 0C/min -> 220 0C (5 min)not specifiednot specified
I 894.938.923.914.914.
ReferenceGrzeszczuk, Wesolowska, et al., 2011Rotsatschakul, Visesanguan, et al., 2009Pyun and Shin, 2006Vinogradov, 2004Vinogradov, 2004
Comment MSDC-RI MSDC-RI MSDC-RI MSDC-RI MSDC-RI
Column type CapillaryCapillaryPacked
Active phase Apieson MOV-1, SE-30, Methyl silicone, SP-2100, OV-101, DB-1, etc.Apiezon M
Column length (m)  50.5.6
Carrier gas  HydrogenN2
Substrate   Chromosorb W AW/DMCS
Column diameter (mm)  0.32
Phase thickness (μm)
Program not specifiednot specified60C(7min), 100C(7min), 150C isothermal
I 946.913.936.
ReferenceGao, Wang, et al., 2003Waggott and Davies, 1984Golovnya, Misharina, et al., 1983
Comment MSDC-RI MSDC-RI MSDC-RI

References

Chin, Nazimah, et al., 2007
Chin, S.T.; Nazimah, S.A.H.; Quek, S.Y.; Che Man, Y.B.; Rahman, R.A.; Hashim, D.M., Analysis of volatile compounds from Malaysian durians (Durio zibethinus) using headspace SPME coupled to fast GC-MS, J. Food Comp. Anal., 2007, 20, 1, 31-44, https://doi.org/10.1016/j.jfca.2006.04.011 . [all data]

Chyau and Mau, 2001
Chyau, C.-C.; Mau, J.-L., Effects of various oils on volatile compounds of deep-fried shallot flavouring, Food Chem., 2001, 74, 1, 41-46, https://doi.org/10.1016/S0308-8146(00)00336-8 . [all data]

Chyau, Lin, et al., 1997
Chyau, C.-C.; Lin, Y.-C.; Mau, J.-L., Storage stability of deep-fried shallot flavoring, J. Agric. Food Chem., 1997, 45, 8, 3211-3215, https://doi.org/10.1021/jf970109z . [all data]