Allyl propyl disulfide

Kovats' RI, non-polar column, isothermal

View large format table.

Column type Active phase Temperature (C) I Reference Comment
CapillaryOV-101130.1088.Misharina and Golovnya, 1989He; Column length: 50. m; Column diameter: 0.32 mm
PackedApiezon M130.1098.Garbuzov, Misharina, et al., 1985He or N2, Chromosorb W, AW-DMCS; Column length: 2.1 m

Kovats' RI, non-polar column, temperature ramp

View large format table.

Column type Active phase I Reference Comment
CapillarySE-541048.Zoghbi, Ramos, et al., 198430. m/0.25 mm/0.25 μm, He, 50. C @ 3. min, 4. K/min; Tend: 230. C

Van Den Dool and Kratz RI, non-polar column, temperature ramp

View large format table.

Column type Active phase I Reference Comment
CapillaryOV-1011077.Misharina and Golovnya, 1989He, 4. K/min; Column length: 50. m; Column diameter: 0.32 mm; Tstart: 50. C; Tend: 250. C

Van Den Dool and Kratz RI, polar column, temperature ramp

View large format table.

Column type Active phase I Reference Comment
CapillaryDB-Wax1436.Nielsen, Larsen, et al., 200430. m/0.25 mm/0.25 μm, He, 45. C @ 10. min, 6. K/min, 240. C @ 30. min
CapillaryDB-Wax1410.Nielsen and Poll, 200430. m/0.25 mm/0.25 μm, He, 45. C @ 10. min, 3. K/min, 240. C @ 30. min
CapillaryHP-Innowax1474.Storsberg, Schulz, et al., 200460. m/0.25 mm/0.5 μm, H2, 10. K/min; Tstart: 35. C; Tend: 220. C
CapillaryCarbowax1430.Edris and Fadel, 2002He, 2. K/min; Column length: 60. m; Column diameter: 0.32 mm; Tstart: 50. C; Tend: 200. C
CapillaryDB-Wax1428.Cha, Kim, et al., 199860. m/0.25 mm/0.25 μm, 40. C @ 5. min, 3. K/min, 200. C @ 60. min
CapillaryCP-Wax 52CB1428.Kim, Wu, et al., 1995N2, 60. C @ 4. min, 2. K/min, 200. C @ 30. min; Column length: 50. m; Column diameter: 0.25 mm
CapillaryCP-Wax 52CB1428.Kim, Wu, et al., 1995N2, 60. C @ 4. min, 2. K/min, 200. C @ 30. min; Column length: 50. m; Column diameter: 0.25 mm
CapillaryCP-Wax 52CB1386.Yu, Wu, et al., 199350. m/0.32 mm/0.25 μm, H2, 40. C @ 10. min, 1.5 K/min, 200. C @ 60. min
CapillaryCP-Wax 52CB1432.Yu, Wu, et al., 1989N2, 2. K/min; Column length: 50. m; Column diameter: 0.22 mm; Tstart: 50. C; Tend: 200. C
CapillaryCP-Wax 52CB1432.Yu, Wu, et al., 1989, 2N2, 2. K/min; Column length: 50. m; Column diameter: 0.22 mm; Tstart: 50. C; Tend: 200. C

Normal alkane RI, non-polar column, temperature ramp

View large format table.

Column type Active phase I Reference Comment
CapillaryDB-5MS1045.Zoghbi, Andrade, et al., 200230. m/0.25 mm/0.25 μm, He, 3. K/min; Tstart: 60. C; Tend: 270. C
CapillaryHP-11058.Lopes, Godoy, et al., 199725. m/0.32 mm/0.17 μm, H2, 5. K/min; Tstart: 40. C; Tend: 200. C

Normal alkane RI, non-polar column, custom temperature program

View large format table.

Column type Active phase I Reference Comment
CapillaryHP-5 MS1072.Pyun and Shin, 200630. m/0.25 mm/0.25 μm; Program: 40 0C (3 min) 2 0C/min -> 150 0C 20 0C/min -> 220 0C (5 min)
CapillarySE-301077.Vinogradov, 2004Program: not specified

References

Misharina and Golovnya, 1989
Misharina, T.A.; Golovnya, R.V., Regularities of retention of a pseudohomologous series of dialkylpolysulfides in capillary gas chromatography, Zh. Anal. Khim., 1989, 44, 514-519. [all data]

Garbuzov, Misharina, et al., 1985
Garbuzov, V.G.; Misharina, T.A.; Aerov, A.F.; Golovnya, R.V., Gas chromatographic retention indices for sulphur(II)-containing organic substances, J. Anal. Chem. USSR (Engl. Transl.), 1985, 40, 4, 576-586. [all data]

Zoghbi, Ramos, et al., 1984
Zoghbi, M.G.B.; Ramos, L.S.; Maia, J.G.S.; da Silva, M.L.; Luz, A.I.R., Volatile sulfides of the Amazonian garlic bush, J. Agric. Food Chem., 1984, 32, 5, 1009-1010, https://doi.org/10.1021/jf00125a014 . [all data]

Nielsen, Larsen, et al., 2004
Nielsen, G.S.; Larsen, L.M.; Poll, L., Impact of blanching and packaging atmosphere on the formation of aroma compounds during long-term frozen storage of leek (Allium ampeloprasum Var. Bulga) slices, J. Agric. Food Chem., 2004, 52, 15, 4844-4852, https://doi.org/10.1021/jf049623c . [all data]

Nielsen and Poll, 2004
Nielsen, G.S.; Poll, L., Determination of odor active aroma compounds in freshly cut leek (Allium ampeloprasum Var. Bulga) and in long-term stored frozen unblanched and blanched leek slices by gas chromatography olfactometry analysis, J. Agric. Food Chem., 2004, 52, 6, 1642-1646, https://doi.org/10.1021/jf030682k . [all data]

Storsberg, Schulz, et al., 2004
Storsberg, J.; Schulz, H.; Keusgen, M.; Tannous, F.; Dehmer, K.J.; Joachim Keller, E.R., Chemical characterization of interspecific hybrids between Allium cepa L. and Allium kermesinum Rchb., J. Agric. Food Chem., 2004, 52, 17, 5499-5505, https://doi.org/10.1021/jf049684a . [all data]

Edris and Fadel, 2002
Edris, A.E.; Fadel, H.M., Investigation of the volatile aroma components of garlic leaves essential oil. Possibility of utilization to enrich garlic bulb oil, Eur. Food Res. Technol., 2002, 214, 2, 105-107, https://doi.org/10.1007/s00217-001-0429-2 . [all data]

Cha, Kim, et al., 1998
Cha, Y.J.; Kim, H.; Cadwallader, K.R., Aroma-active compounds in Kimchi during fermentation, J. Agric. Food Chem., 1998, 46, 5, 1944-1953, https://doi.org/10.1021/jf9706991 . [all data]

Kim, Wu, et al., 1995
Kim, S.M.; Wu, C.M.; Kubota, K.; Kobayashi, A., Effect of soybean oil on garlic volatile compounds isoalted by distillation, J. Agric. Food Chem., 1995, 43, 2, 449-452, https://doi.org/10.1021/jf00050a036 . [all data]

Yu, Wu, et al., 1993
Yu, T.-H.; Wu, C.-M.; Ho, C.-T., Volatile compounds of deep-oil fried, microwave-heated, and oven-baked garlic slices, J. Agric. Food Chem., 1993, 41, 5, 800-805, https://doi.org/10.1021/jf00029a023 . [all data]

Yu, Wu, et al., 1989
Yu, T.-H.; Wu, C.-M.; Liou, Y.-C., Volatile compounds from garlic, J. Agric. Food Chem., 1989, 37, 3, 725-730, https://doi.org/10.1021/jf00087a032 . [all data]

Yu, Wu, et al., 1989, 2
Yu, T.-H.; Wu, C.-M.; Chen, S.-Y., Effects of pH adjustment and heat treatment on the stability and the formation of volatile compounds of garlic, J. Agric. Food Chem., 1989, 37, 3, 730-734, https://doi.org/10.1021/jf00087a033 . [all data]

Zoghbi, Andrade, et al., 2002
Zoghbi, M.G.B.; Andrade, E.H.A.; Maia, J.G.S., Volatile constituents from Adenocalymma alliaceum Miers and Petiveria alliacea L., two medicinal herbs of the Amazon, Flavour Fragr. J., 2002, 17, 2, 133-135, https://doi.org/10.1002/ffj.1051 . [all data]

Lopes, Godoy, et al., 1997
Lopes, D.; Godoy, R.L.O.; Goncalves, S.L.; Koketsu, M.; Oliveira, A.M., Sulphur constituents of the essential oil of Nira (Allium tuberosum Rottl.) cultivated in Brazil, Flavour Fragr. J., 1997, 12, 4, 237-239, https://doi.org/10.1002/(SICI)1099-1026(199707)12:4<237::AID-FFJ644>3.0.CO;2-9 . [all data]

Pyun and Shin, 2006
Pyun, M.-S.; Shin, S., Antifungal effects of the volatile oils from Allium plants against Trichophyton species and synergism of the oils with ketoconazole, Phytomedicine, 2006, 13, 6, 394-400, https://doi.org/10.1016/j.phymed.2005.03.011 . [all data]

Vinogradov, 2004
Vinogradov, B.A., Production, composition, properties and application of essential oils, 2004, retrieved from http://viness.narod.ru. [all data]