Pyrido[3,2-f] [1,7]phenanthroline

Phase change data

Data compiled by: William E. Acree, Jr., James S. Chickos

Enthalpy of vaporization

ΔvapH (kcal/mol) Temperature (K) Method Reference Comment
16.1663.A,IStephenson and Malanowski, 1987Based on data from 648. - 706. K. See also Johns, McElhill, et al., 1962.

References

Stephenson and Malanowski, 1987
Stephenson, Richard M.; Malanowski, Stanislaw, Handbook of the Thermodynamics of Organic Compounds, 1987, https://doi.org/10.1007/978-94-009-3173-2 . [all data]

Johns, McElhill, et al., 1962
Johns, I.B.; McElhill, E.A.; Smith, J.O., Thermal Stability of Some Organic Compounds., J. Chem. Eng. Data, 1962, 7, 2, 277-281, https://doi.org/10.1021/je60013a036 . [all data]