Cyanazine
- Formula: C9H13ClN6
- Molecular weight: 240.693
- IUPAC Standard InChIKey: MZZBPDKVEFVLFF-UHFFFAOYSA-N
- CAS Registry Number: 21725-46-2
- Chemical structure:
- Other names: Propanenitrile, 2-[[4-chloro-6-(ethylamino)-1,3,5-triazin-2-yl]amino]-2-methyl-; Propionitrile, 2-[[4-chloro-6-(ethylamino)-s-triazin-2-yl]amino]-2-methyl-; Bladex; Bladex 80WP; DW 3418; SD 15418; WL 19805; 2-[[4-Chloro-6-(ethylamino)-s-triazin-2-yl]amino]-2-methylpropionitrile; Fortol; Fortrol; Payze; Propionitrile, 2-[[4-chloro-6-(ethylamino)-1,3,5-triazin-2-yl]amino]-2-methyl; S-Triazine, 2-chloro-4-(ethylamino)-6-(1-cyano-1-methyl)(ethylamino)-; 2-Chloro-4-(1-cyano-1-methylethylamino)-6-ethylamino-s-triazine; Cyanazin; 2-[[4-Chloro-6-(ethylamino)-1,3,5-triazin-2-yl]amino]-2-methylpropanenitrile

Phase change data

Data compiled as indicated in comments:
TRC - Thermodynamics Research Center, NIST Boulder Laboratories, Chris Muzny director
AC - William E. Acree, Jr., James S. Chickos
Quantity | Value | Units | Method | Reference | Comment |
---|---|---|---|---|---|
Tfus | 438.74 | K | N/A | Donnelly, Drewes, et al., 1990 | Uncertainty assigned by TRC = 0.2 K; TRC |
Enthalpy of sublimation
ΔsubH (kJ/mol) | Temperature (K) | Method | Reference | Comment |
---|---|---|---|---|
90.7 | 352. | GS | Grayson and Fosbraey, 2006 | Based on data from 339. to 365. K.; AC |
Enthalpy of fusion
ΔfusH (kJ/mol) | Temperature (K) | Method | Reference | Comment |
---|---|---|---|---|
41.96 | 437.9 | DSC | Acree, 1991 | See also Donnelly, Drewes, et al., 1990, 2.; AC |

References

Donnelly, Drewes, et al., 1990
Donnelly, J.R.; Drewes, L.A.; Johnson, R.L.; Munslow, W.D.; Knapp, K.K.; Sovocool, G.W.,
Purity and heat of fusion data for environmental standards as determined by differential scanning calorimetry,
Thermochim. Acta, 1990, 167, 2, 155, https://doi.org/10.1016/0040-6031(90)80476-F
. [all data]
Grayson and Fosbraey, 2006
Grayson, B. Terence; Fosbraey, Lynda A.,
Determination of the vapour pressure of pesticides,
Pestic. Sci., 2006, 13, 3, 269-278, https://doi.org/10.1002/ps.2780130308
. [all data]
Acree, 1991
Acree, William E.,
Thermodynamic properties of organic compounds: enthalpy of fusion and melting point temperature compilation,
Thermochimica Acta, 1991, 189, 1, 37-56, https://doi.org/10.1016/0040-6031(91)87098-H
. [all data]
Donnelly, Drewes, et al., 1990, 2
Donnelly, J.R.; Drewes, L.A.; Johnson, R.L.; Munslow, W.D.; Knapp, K.K.; Sovocool, G.W.,
Purity and heat of fusion data for environmental standards as determined by differential scanning calorimetry,
Thermochimica Acta, 1990, 167, 2, 155-187, https://doi.org/10.1016/0040-6031(90)80476-F
. [all data]