Naphthalene, 1,2,3,4-tetrahydro-5,7-dimethyl-

Van Den Dool and Kratz RI, non-polar column, temperature ramp

View large format table.

Column type Active phase I Reference Comment
CapillaryPetrocol DH1374.White, Hackett, et al., 1992100. m/0.25 mm/0.5 μm, He, 1. K/min; Tstart: 30. C; Tend: 220. C

Normal alkane RI, non-polar column, custom temperature program

View large format table.

Column type Active phase I Reference Comment
CapillaryApieson L1383.Vaisberg and Gizitdinova, 1969Helium; Column length: 50. m; Column diameter: 0.25 mm; Program: not specified

References

White, Hackett, et al., 1992
White, C.M.; Hackett, J.; Anderson, R.R.; Kail, S.; Spock, P.S., Linear temperature programmed retention indices of gasoline range hydrocarbons and chlorinated hydrocarbons on cross-linked polydimethylsiloxane, J. Hi. Res. Chromatogr., 1992, 15, 2, 105-120, https://doi.org/10.1002/jhrc.1240150211 . [all data]

Vaisberg and Gizitdinova, 1969
Vaisberg, K.M.; Gizitdinova, V.G., Gas chromatographic investigation of tetralin and its homologues C11-C12, Neftekhimia (Rus), 1969, 9, 3, 482-486. [all data]