Zinc, bis(manganese pentacarbonyl)-

Gas phase ion energetics data

Data compiled by: Sharon G. Lias, John E. Bartmess, Joel F. Liebman, John L. Holmes, Rhoda D. Levin, and W. Gary Mallard

Ionization energy determinations

IE (eV) Method Reference Comment
7.3PELouwen, Andrea, et al., 1982
7.70PELouwen, Andrea, et al., 1982Vertical value

References

Louwen, Andrea, et al., 1982
Louwen, J.N.; Andrea, R.R.; Stufkens, D.J.; Oskam, A., He(I) and He(II) photoelectron spectra of M[Co(CO)4]2 and M[Mn(CO)5]2 complexes (M = Zn, Cd, and Hg), Z. Naturforsch. B:, 1982, 37, 711. [all data]