cis-4-Decenal

Phase change data

Data compiled by: William E. Acree, Jr., James S. Chickos

Quantity Value Units Method Reference Comment
Δvap59.3kJ/molCGCKoutek, Hoskovec, et al., 1996Based on data from 323. - 343. K. See also Ova, Koultek, et al., 2000.

Kovats' RI, non-polar column, temperature ramp

View large format table.

Column type Active phase I Reference Comment
CapillarySE-541193.Adams, 200030. m/0.26 mm/0.25 μm, He, 3. K/min; Tstart: 60. C; Tend: 246. C
CapillaryDB-51193.Adams, 2000, 230. m/0.26 mm/0.25 μm, He, 3. K/min; Tstart: 60. C; Tend: 246. C
CapillaryDB-51193.Adams, 199930. m/0.26 mm/0.25 μm, He, 3. K/min; Tstart: 60. C; Tend: 246. C

Van Den Dool and Kratz RI, non-polar column, temperature ramp

View large format table.

Column type Active phase I Reference Comment
CapillaryDB-51193.Pavlovic, Tzakou, et al., 200630. m/0.32 mm/0.25 μm, He, 3. K/min; Tstart: 60. C; Tend: 280. C
CapillaryZB-51188.Mahattanatawee, Rouseff, et al., 200530. m/0.32 mm/0.5 μm, He, 7. K/min, 265. C @ 5. min; Tstart: 40. C
CapillarySPB-11170.Chisholm, Jell, et al., 200330. m/0.25 mm/0.25 μm, He, 35. C @ 5. min, 4. K/min, 225. C @ 20. min
CapillarySPB-11171.Chisholm, Jell, et al., 200330. m/0.25 mm/0.25 μm, He, 35. C @ 5. min, 4. K/min, 225. C @ 20. min
CapillaryDB-51200.Högnadóttir and Rouseff, 200330. m/0.32 mm/0.5 μm, 7. K/min, 265. C @ 5. min; Tstart: 40. C
CapillaryHP-11170.Nath, Sarma, et al., 200224. m/0.32 mm/0.17 μm, He, 60. C @ 2. min, 4. K/min, 250. C @ 20. min
CapillaryHP-11169.7Siegmund and Pfannhauser, 199925. m/0.2 mm/0.33 μm, 4. K/min, 250. C @ 2. min; Tstart: 35. C
CapillaryHP-51194.4Siegmund and Pfannhauser, 199930. m/0.25 mm/0.25 μm, 5.3 K/min, 250. C @ 2. min; Tstart: 35. C

Van Den Dool and Kratz RI, polar column, temperature ramp

View large format table.

Column type Active phase I Reference Comment
CapillaryDB-Wax1542.Mahattanatawee, Rouseff, et al., 200530. m/0.32 mm/0.5 μm, He, 7. K/min, 240. C @ 5. min; Tstart: 40. C
CapillaryDB-Wax1544.Bell, 200430. m/0.32 mm/0.50 μm, Helium, 7. K/min, 240. C @ 5. min; Tstart: 40. C
CapillaryInnowax1546.Chisholm, Jell, et al., 200315. m/0.25 mm/0.25 μm, He, 35. C @ 5. min, 4. K/min, 225. C @ 20. min
CapillaryDB-Wax1544.Högnadóttir and Rouseff, 200330. m/0.32 mm/0.5 μm, 7. K/min, 240. C @ 5. min; Tstart: 40. C

Normal alkane RI, non-polar column, temperature ramp

View large format table.

Column type Active phase I Reference Comment
CapillaryHP-51199.Radulovic, Dordevic, et al., 201030. m/0.25 mm/0.25 μm, Hydrogen, 5. K/min; Tstart: 70. C; Tend: 290. C
CapillaryHP-5 MS1193.Adams, Beauchamp, et al., 200730. m/0.25 mm/0.25 μm, Helium, 50. C @ 10. min, 3. K/min, 230. C @ 10. min
CapillaryDB-11197.Pala-Paul J., Perez-Alonso M.J., et al., 200650. m/0.25 mm/0.25 μm, N2, 4. K/min; Tstart: 95. C; Tend: 240. C
CapillaryDB-51205.Miyazawa, Fuhita, et al., 2004Helium, 2. K/min, 240. C @ 999. min; Column length: 30. m; Column diameter: 0.25 mm; Tstart: 60. C
CapillaryDB-51205.Miyazawa, Fujita, et al., 2004Helium, 2. K/min, 240. C @ 999. min; Column length: 50. m; Column diameter: 0.25 mm; Tstart: 60. C

Normal alkane RI, non-polar column, custom temperature program

View large format table.

Column type Active phase I Reference Comment
CapillarySE-301177.Vinogradov, 2004Program: not specified
CapillarySE-541192.Buettner, Mestres, et al., 200330. m/0.32 mm/0.25 μm; Program: 35C (2min) => 40C/min => 50C (2min) => 6C/min => 180C => 10C/min => 230C (10min)

Normal alkane RI, polar column, temperature ramp

View large format table.

Column type Active phase I Reference Comment
CapillaryStabilwax1525.Jirovetz, Buchbauer, et al., 200530. m/0.32 mm/0.5 μm, H2, 40. C @ 5. min, 6. K/min, 280. C @ 5. min
CapillaryDB-Wax1550.Kumazawa and Masuda, 199930. m/0.53 mm/1. μm, 5. K/min; Tstart: 40. C; Tend: 210. C
CapillaryDB-Wax1544.Kumazawa and Masuda, 199960. m/0.25 mm/0.25 μm, 5. K/min; Tstart: 40. C; Tend: 210. C

Normal alkane RI, polar column, custom temperature program

View large format table.

Column type Active phase I Reference Comment
CapillaryCarbowax 20M1523.Vinogradov, 2004Program: not specified
CapillaryFFAP1530.Buettner, Mestres, et al., 200330. m/0.32 mm/0.25 μm; Program: 35C (2min) => 40C/min => 60C (2min) => 6C/min => 180C => 10C/min => 230C (10min

References

Koutek, Hoskovec, et al., 1996
Koutek, Bohumir; Hoskovec, Michal; Vrkocov, Pavlína; Konecný, Karel; Feltl, Ladislav; Vrkoc, Jan, Gas chromatographic determination of vapour pressures of pheromone-like compounds III. Aldehydes, Journal of Chromatography A, 1996, 719, 2, 391-400, https://doi.org/10.1016/0021-9673(95)00740-7 . [all data]

Ova, Koultek, et al., 2000
Ova, P.V.; Koultek, B.; Hoskovec, M., Practice Oriented Results on Use and Production of Neem Ingredients and Pheromones VI, H. Kleeberg and C.P.W. Zebitz, ed(s)., Druck and Graphic, Giessen, 2000, 211-218. [all data]

Adams, 2000
Adams, R.P., Systematics of smooth leaf margin Juniperus of the western hemisphere based on leaf essential oils and RAPD DNA fingerprinting, Biochem. Syst. Ecol., 2000, 28, 2, 149-162, https://doi.org/10.1016/S0305-1978(99)00047-2 . [all data]

Adams, 2000, 2
Adams, R.P., The serrate leaf margined Juniperus (Section Sabina) of the western hemisphere: systematics and evolution based on leaf essential oils and Random Amplified Polymorphic DNAs (RAPDs), Biochem. Syst. Ecol., 2000, 28, 10, 975-989, https://doi.org/10.1016/S0305-1978(00)00022-3 . [all data]

Adams, 1999
Adams, R.P., Systematics of multi-seeded eastern hemisphere Juniperus based on leaf essential oils and RAPD DNA fingerprinting, Biochem. Syst. Ecol., 1999, 27, 7, 709-725, https://doi.org/10.1016/S0305-1978(99)00016-2 . [all data]

Pavlovic, Tzakou, et al., 2006
Pavlovic, M.; Tzakou, O.; Petrakis, P.V.; Couladis, M., The essential oil of Hypericum perforatum L., Hypericum tetrapterum Fries and Hypericum olympicum L. growing in Greece, Flavour Fragr. J., 2006, 21, 1, 84-87, https://doi.org/10.1002/ffj.1521 . [all data]

Mahattanatawee, Rouseff, et al., 2005
Mahattanatawee, K.; Rouseff, R.; Filomena Valim, M.; Naim, M., Identification and aroma impact of norisoprenoids in orange juice, J. Agric. Food Chem., 2005, 53, 2, 393-397, https://doi.org/10.1021/jf049012k . [all data]

Chisholm, Jell, et al., 2003
Chisholm, M.G.; Jell, J.A.; Cass, D.M., Jr., Characterization of the major odorants found in the peel oil of Citrus reticulata Blanco cv. Clementine using gas chromatography-olfactometry, Flavour Fragr. J., 2003, 18, 4, 275-281, https://doi.org/10.1002/ffj.1188 . [all data]

Högnadóttir and Rouseff, 2003
Högnadóttir, Á.; Rouseff, R.L., Identification of aroma active compounds in organce essence oil using gas chromatography-olfactometry and gas chromatography-mass spectrometry, J. Chromatogr. A, 2003, 998, 1-2, 201-211, https://doi.org/10.1016/S0021-9673(03)00524-7 . [all data]

Nath, Sarma, et al., 2002
Nath, S.C.; Sarma, K.K.; Vajezikova, I.; Leclercq, P.A., Comparison of volatile inflorescence oils and taxonomy of certain Cymbopogon taxa described as Cymbopogon flexuosus (Nees ex Steud.) Wats., Biochem. Syst. Ecol., 2002, 30, 2, 151-162, https://doi.org/10.1016/S0305-1978(01)00066-7 . [all data]

Siegmund and Pfannhauser, 1999
Siegmund, B.; Pfannhauser, W., Changes of the volatile fraction of cooked chicken meat during chill storing: results obtained by the electronic nose in comparison to GC-MS and GC olfactometry, Z. Lebensm. Unters. Forsch. A, 1999, 208, 5-6, 336-341, https://doi.org/10.1007/s002170050426 . [all data]

Bell, 2004
Bell, W.A.-M., Examination of Aroma Volatiles Formed from Thermal Processing of Florida Reconstituted Grapefruit Juice. A Thesis presented to the graduate school of the university of Florida in partial fulfillment of the requirements for the degree of master of science, 2004. [all data]

Radulovic, Dordevic, et al., 2010
Radulovic, N.S.; Dordevic, N.D.; Palic, R.M., Volatiles of Pleurospermum austriacum (L.) Hoffm. (Apiaceae), J. Serbian Chem. Soc., 2010, 75, 12, 1-11, https://doi.org/10.2298/JSC100323127R . [all data]

Adams, Beauchamp, et al., 2007
Adams, R.P.; Beauchamp, P.S.; Dev, V.; Dutz, S.M., New Natural Products Isolated from One-Seeded Juniperus of the Southwestern United States: Isolation and Occurence of 2-Ethenyl-3-methyl Phanol and Its Derivatives, J. Essent. Oil Res., 2007, 19, 2, 146-152, https://doi.org/10.1080/10412905.2007.9699247 . [all data]

Pala-Paul J., Perez-Alonso M.J., et al., 2006
Pala-Paul J.; Perez-Alonso M.J.; Velasco-Negueruela A.; Ballesteros M.T.; Sanz J., Essential oil composition of Sideritis hirsuta L. from Guadalajara Province, Spain, Flavour Fragr. J., 2006, 21, 3, 410-415, https://doi.org/10.1002/ffj.1727 . [all data]

Miyazawa, Fuhita, et al., 2004
Miyazawa, M.; Fuhita, T.; Yamafuji, C.; Matsui, M.; Kasahara, N.; Takagi, Y.; Ishikawa, Y., Chemical composition of volatile oil from the roots of Periploca sepium, J. Oleo Sci., 2004, 53, 10, 511-513, https://doi.org/10.5650/jos.53.511 . [all data]

Miyazawa, Fujita, et al., 2004
Miyazawa, M.; Fujita, T.; Yamafuji, C.; Matsui, M.; Kasahara, N.; Takagi, Y.; Ishikawa, Y., Chemical composition of volatile oil from the roots of Periploca sepium, J. Oleo Sci., 2004, 53, 11, 511-513, https://doi.org/10.5650/jos.53.511 . [all data]

Vinogradov, 2004
Vinogradov, B.A., Production, composition, properties and application of essential oils, 2004, retrieved from http://viness.narod.ru. [all data]

Buettner, Mestres, et al., 2003
Buettner, A.; Mestres, M.; Fischer, A.; Guasch, J.; Schieberle, P., Evaluation of the most odour-active compounds in the peel oil of clementines ( citrus reticulata blanco cv. clementine), Eur. Food Res. Technol., 2003, 216, 11-14. [all data]

Jirovetz, Buchbauer, et al., 2005
Jirovetz, L.; Buchbauer, G.; Ngassoum, M.B.; Parmentier, M., Chemical composition and olfactory characterization of essential oils of fruits and seeds of African pear (Dacryodes edulis (G. Don) H. J. Lam) from Cameroon, Flavour Fragr. J., 2005, 20, 2, 215-218, https://doi.org/10.1002/ffj.1324 . [all data]

Kumazawa and Masuda, 1999
Kumazawa, K.; Masuda, H., Identification of potent odorants in Japanese green tea (Sen-cha), J. Agric. Food Chem., 1999, 47, 12, 5169-5172, https://doi.org/10.1021/jf9906782 . [all data]