3,7-Cyclodecadiene-1-methanol, α,α,4,8-tetramethyl-, [s-(Z,Z)]

Van Den Dool and Kratz RI, non-polar column, temperature ramp

Data compiled by: NIST Mass Spectrometry Data Center, William E. Wallace, director

Column type CapillaryCapillaryCapillary
Active phase HP-5DB-5DB-1
Column length (m) 30.25.25.
Carrier gas HeN2N2
Substrate
Column diameter (mm) 0.250.250.25
Phase thickness (μm) 0.250.25
Tstart (C) 60.75.60.
Tend (C) 250.210.180.
Heat rate (K/min) 10.3.3.
Initial hold (min) 2.10.10.
Final hold (min) 10.1.10.
I 1559.1530.1528.
ReferenceLiu J.M., Nan P., et al., 2006bin Ahmad and bin Jantan, 2003bin Jantan and bin Ahmad, 2002
Comment MSDC-RI MSDC-RI MSDC-RI

Normal alkane RI, polar column, custom temperature program

Data compiled by: NIST Mass Spectrometry Data Center, William E. Wallace, director

Column type CapillaryCapillary
Active phase InnowaxNB-351
Column length (m) 60.25.
Carrier gas He
Substrate
Column diameter (mm) 0.250.32
Phase thickness (μm) 0.250.2
Program 60 0C (10 min) 4 K/min -> 220 0C (10 min) 1 K/min -> 240 0C40C(5min) => 4C/min => 170C => 8C/min => 240C (12min)
I 2122.2100.
ReferenceBaser, Özek, et al., 2000Kerrola, Galambosi, et al., 1994
Comment MSDC-RI MSDC-RI

Van Den Dool and Kratz RI, polar column, temperature ramp

Data compiled by: NIST Mass Spectrometry Data Center, William E. Wallace, director

Column type Capillary
Active phase PEG-20M
Column length (m) 25.
Carrier gas He
Substrate
Column diameter (mm) 0.25
Phase thickness (μm) 0.3
Tstart (C) 50.
Tend (C) 220.
Heat rate (K/min) 3.
Initial hold (min) 1.
Final hold (min) 5.
I 2037.
ReferenceRubiolo P., Matteodo M., et al., 2006
Comment MSDC-RI

References

Liu J.M., Nan P., et al., 2006
Liu J.M.; Nan P.; Tsering Q.; Tsering T.; Bai Z.K.; Wang L.; Liu Z.J.; Zhong Y., Volatile constituents of the leaves and flowers of Salvia przewalskii Maxim. from Tibet, Flavour Fragr. J., 2006, 21, 3, 435-438, https://doi.org/10.1002/ffj.1607 . [all data]

bin Ahmad and bin Jantan, 2003
bin Ahmad, F.; bin Jantan, I., Chemical constituents of the essential oils of Goniothalamus uvariodes King, Flavour Fragr. J., 2003, 18, 2, 128-130, https://doi.org/10.1002/ffj.1142 . [all data]

bin Jantan and bin Ahmad, 2002
bin Jantan, I.; bin Ahmad, F., Chemical constituents of the essential oils of Goniothalamus malayanus Hook. f. and Thoms., Flavour Fragr. J., 2002, 17, 5, 372-374, https://doi.org/10.1002/ffj.1107 . [all data]