1-[2-(Ethenyloxy)ethyl]-1-nitrosohydrazine

Phase change data

Data compiled by: William E. Acree, Jr., James S. Chickos

Quantity Value Units Method Reference Comment
Δsub112.1 ± 1.9kJ/molN/ALebedev, Chironov, et al., 1998

References

Lebedev, Chironov, et al., 1998
Lebedev, V.P.; Chironov, V.V.; Vorob'eva, V.P.; Matyushin, Yu.N., Energy of the dissociation of the bond N-NO in methylnitrosohydrazine, Khim. Fiz., 1998, 17, 9, 54. [all data]