2-Propenoic acid, tetradecyl ester

Phase change data

Data compiled as indicated in comments:
TRC - Thermodynamics Research Center, NIST Boulder Laboratories, Chris Muzny director
AC - William E. Acree, Jr., James S. Chickos

Quantity Value Units Method Reference Comment
Tfus287.KN/ARehberg and Fisher, 1944Uncertainty assigned by TRC = 3. K; TRC

Enthalpy of vaporization

ΔvapH (kJ/mol) Temperature (K) Method Reference Comment
69.4473.AStephenson and Malanowski, 1987Based on data from 458. - 601. K.; AC

In addition to the Thermodynamics Research Center (TRC) data available from this site, much more physical and chemical property data is available from the following TRC products:

Kovats' RI, non-polar column, isothermal

View large format table.

Column type Active phase Temperature (C) I Reference Comment
CapillaryOV-101200.1876.Horna, Táborský, et al., 1985N2; Column length: 19. m; Column diameter: 0.28 mm

Kovats' RI, polar column, isothermal

View large format table.

Column type Active phase Temperature (C) I Reference Comment
CapillarySP-1000200.2201.Horna, Táborský, et al., 1985N2; Column length: 46. m; Column diameter: 0.23 mm

References

Rehberg and Fisher, 1944
Rehberg, C.E.; Fisher, C.H., Preparatioon and Properties of the n-Alkyl Acrylates, J. Am. Chem. Soc., 1944, 66, 1203-7. [all data]

Stephenson and Malanowski, 1987
Stephenson, Richard M.; Malanowski, Stanislaw, Handbook of the Thermodynamics of Organic Compounds, 1987, https://doi.org/10.1007/978-94-009-3173-2 . [all data]