2,4-Diacetyl-1,3-benzenediol

Condensed phase thermochemistry data

Data compiled by: Hussein Y. Afeefy, Joel F. Liebman, and Stephen E. Stein

Quantity Value Units Method Reference Comment
Δcsolid-1102.0 ± 1.5kcal/molCcbBonino, Manzoni-Ansidei, et al., 1937Reanalyzed by Cox and Pilcher, 1970, Original value = -1103.5 kcal/mol; Corresponding Δfsolid = -180.1 kcal/mol (simple calculation by NIST; no Washburn corrections)

References

Bonino, Manzoni-Ansidei, et al., 1937
Bonino, G.B.; Manzoni-Ansidei, R.; Rolla, M., Contributi sperimentali al probema della chelazione. VI. Ricerche termochimiche su acetilfenoli e acetil-resorcine, Ricerca Sci., 1937, 8, 357-360. [all data]

Cox and Pilcher, 1970
Cox, J.D.; Pilcher, G., Thermochemistry of Organic and Organometallic Compounds, Academic Press, New York, 1970, 1-636. [all data]