1,8-Dichlorooctane

Phase change data

Data compiled as indicated in comments:
BS - Robert L. Brown and Stephen E. Stein
AC - William E. Acree, Jr., James S. Chickos

Quantity Value Units Method Reference Comment
Tboil514.2KN/AWeast and Grasselli, 1989BS
Quantity Value Units Method Reference Comment
Δvap15.7kcal/molN/AVarushchenko, Loseva, et al., 1988Based on data from 410. - 510. K. See also Basarová and Svoboda, 1991.; AC

Reduced pressure boiling point

Tboil (K) Pressure (atm) Reference Comment
388.70.014Aldrich Chemical Company Inc., 1990BS
391.70.018Weast and Grasselli, 1989BS

Enthalpy of vaporization

ΔvapH (kcal/mol) Temperature (K) Reference Comment
13.4426.Dykyj, Svoboda, et al., 1999Based on data from 410. - 510. K.; AC
11.3415.Dykyj, Svoboda, et al., 1999Based on data from 351. - 480. K.; AC

Normal alkane RI, non-polar column, isothermal

View large format table.

Column type Active phase Temperature (C) I Reference Comment
CapillaryApiezon L130.1332.Arruda, Junkes, et al., 2008

References

Weast and Grasselli, 1989
CRC Handbook of Data on Organic Compounds, 2nd Editon, Weast,R.C and Grasselli, J.G., ed(s)., CRC Press, Inc., Boca Raton, FL, 1989, 1. [all data]

Varushchenko, Loseva, et al., 1988
Varushchenko, R.M.; Loseva, O.L.; Druzhinina, A.I.; Zorina, E.F., Zh. Fiz. Khim., 1988, 62, 1776. [all data]

Basarová and Svoboda, 1991
Basarová, Pavlína; Svoboda, Václav, Calculation of heats of vaporization of halogenated hydrocarbons from saturated vapour pressure data, Fluid Phase Equilibria, 1991, 68, 13-34, https://doi.org/10.1016/0378-3812(91)85008-I . [all data]

Aldrich Chemical Company Inc., 1990
Aldrich Chemical Company Inc., Catalog Handbook of Fine Chemicals, Aldrich Chemical Company, Inc., Milwaukee WI, 1990, 1. [all data]

Dykyj, Svoboda, et al., 1999
Dykyj, J.; Svoboda, J.; Wilhoit, R.C.; Frenkel, M.L.; Hall, K.R., Vapor Pressure of Chemicals: Part A. Vapor Pressure and Antoine Constants for Hydrocarbons and Sulfur, Selenium, Tellurium and Hydrogen Containing Organic Compounds, Springer, Berlin, 1999, 373. [all data]

Arruda, Junkes, et al., 2008
Arruda, A.C.S.; Junkes, B. da.S.; Souza, E.S.; Yunes, R.A.; Heizen, V.E.F., Semi-Emlirical Topological Index to Predict Properties of Halogenated Aliphatic Compounds, J. Chemometrics, 2008, 22, 3-4, 186-194, https://doi.org/10.1002/cem.1121 . [all data]