Leptophos

Kovats' RI, non-polar column, temperature ramp

Data compiled by: NIST Mass Spectrometry Data Center, William E. Wallace, director

Column type Capillary
Active phase DB-1
Column length (m) 15.
Carrier gas He
Substrate
Column diameter (mm) 0.25
Phase thickness (μm)
Tstart (C) 100.
Tend (C) 270.
Heat rate (K/min) 6.
Initial hold (min)
Final hold (min)
I 2495.
ReferenceHall, Whitehead, et al., 1986
Comment MSDC-RI

References

Hall, Whitehead, et al., 1986
Hall, G.L.; Whitehead, W.E.; Mourer, C.R.; Shibamoto, T., A new gas chromatographic retention index for pesticides and related compounds, J. Hi. Res. Chromatogr. Chromatogr. Comm., 1986, 9, 5, 266-271, https://doi.org/10.1002/jhrc.1240090503 . [all data]