Tetrabenzo[a,c,l,o]pentacene

Gas phase ion energetics data

Data compiled by: Sharon G. Lias, Rhoda D. Levin, and Sherif A. Kafafi

Ionization energy determinations

IE (eV) Method Reference
6.65 ± 0.02PESchmidt, 1977
6.77PEClar and Schmidt, 1975

References

Schmidt, 1977
Schmidt, W., Photoelectron spectra of polynuclear aromatics. V. Correlations with ultraviolet absorption spectra in the catacondensed series, J. Chem. Phys., 1977, 66, 828. [all data]

Clar and Schmidt, 1975
Clar, E.; Schmidt, W., Correlations btween photoelectron and ultraviolet absorption spectra of polycyclic hydrocarbons and the number of aromatic sextets, Tetrahedron, 1975, 31, 2263. [all data]