Tricyclo[4.2.2.02,5]dec-3,7,9-triene

Phase change data

Data compiled by: William E. Acree, Jr., James S. Chickos

Quantity Value Units Method Reference Comment
Δvap47.9 ± 0.4kJ/molGSVerevkin, Kümmerlin, et al., 2002Based on data from 296. - 326. K.

Enthalpy of vaporization

ΔvapH (kJ/mol) Temperature (K) Method Reference Comment
47.2 ± 0.4311.GSVerevkin, Kümmerlin, et al., 2002Based on data from 296. - 326. K.

Enthalpy of fusion

ΔfusH (kJ/mol) Temperature (K) Method Reference
1.46293.7DSCVerevkin, Kümmerlin, et al., 2002

References

Verevkin, Kümmerlin, et al., 2002
Verevkin, Sergei P.; Kümmerlin, Martin; Hickl, Ernst; Beckhaus, Hans-Dieter; Rüchardt, Christoph; Kozhushkov, Sergei I.; Haag, Rainer; Boese, Roland; Benet-Bucholz, Jordi; Nordhoff, Karsten; Meijere, Armin de, Thermochemical and X-ray Crystallographic Investigations of Some (CH)10 Hydrocarbons: Basketene, Nenitzescu's Hydrocarbon, and Snoutene, Eur. J. Org. Chem., 2002, 2002, 14, 2280-262, https://doi.org/10.1002/1099-0690(200207)2002:14<2280::AID-EJOC2280>3.0.CO;2-R . [all data]