Decyl acrylate

Phase change data

Data compiled by: William E. Acree, Jr., James S. Chickos

Enthalpy of vaporization

ΔvapH (kJ/mol) Temperature (K) Method Reference Comment
59.6419.AStephenson and Malanowski, 1987Based on data from 404. - 536. K.

Kovats' RI, non-polar column, isothermal

View large format table.

Column type Active phase Temperature (C) I Reference Comment
CapillaryOV-101170.1474.Horna, Táborský, et al., 1985N2; Column length: 19. m; Column diameter: 0.28 mm
CapillaryOV-101200.1474.Horna, Táborský, et al., 1985N2; Column length: 19. m; Column diameter: 0.28 mm

Kovats' RI, polar column, isothermal

View large format table.

Column type Active phase Temperature (C) I Reference Comment
CapillarySP-1000170.1789.Horna, Táborský, et al., 1985N2; Column length: 46. m; Column diameter: 0.23 mm
CapillarySP-1000200.1795.Horna, Táborský, et al., 1985N2; Column length: 46. m; Column diameter: 0.23 mm

Van Den Dool and Kratz RI, non-polar column, temperature ramp

View large format table.

Column type Active phase I Reference Comment
CapillaryMDN-51493.Yoo, Pace, et al., 200430. m/0.32 mm/0.25 μm, He, 50. C @ 3. min, 10. K/min, 320. C @ 10. min

Normal alkane RI, non-polar column, temperature ramp

View large format table.

Column type Active phase I Reference Comment
CapillaryMDN-51493.Yoo, Pace, et al., 2004, 230. m/0.32 mm/0.25 μm, Helium, 50. C @ 3. min, 10. K/min, 320. C @ 10. min

References

Stephenson and Malanowski, 1987
Stephenson, Richard M.; Malanowski, Stanislaw, Handbook of the Thermodynamics of Organic Compounds, 1987, https://doi.org/10.1007/978-94-009-3173-2 . [all data]

Horna, Táborský, et al., 1985
Horna, A.; Táborský, J.; Dufka, O.; Matousek, P.; Churácek, J., Chromatography of monomers. II. Glass capillary gas chromatography of C1-C18 alkyl esters of acrylic and methacrylic acids, J. Chromatogr., 1985, 325, 367-378, https://doi.org/10.1016/S0021-9673(00)96047-3 . [all data]

Yoo, Pace, et al., 2004
Yoo, S.J.; Pace, G.V.; Khoo, B.K.; Lech, J.; Hartman, T.G., Mass Spectrometry and Gas Chromatographic Retention Indices of Selected UV/EB-Curable Monomers and Photoinitiators Commonly Used in Food Packaging Print and Coating Formulations, Radtech Report, Radtech Report; Technical Paper, 2004, 8. [all data]

Yoo, Pace, et al., 2004, 2
Yoo, S.J.; Pace, G.V.; Khoo, B.K.; Lech, J.; Hartman, T.G., Mass spectrometry and gas chromatographic retention indices of selected UV/EB-Curable monomers and photoinitiators commonly used in food packaging print and coating formulations, RAD Tech. Report, 2004, 3, 60-68. [all data]