Oleic Acid, (Z)-, TMS derivative

Van Den Dool and Kratz RI, non-polar column, temperature ramp

View large format table.

Column type Active phase I Reference Comment
CapillaryUltra-12208.86Richmond and Pombo-Villar, 199725. m/0.32 mm/0.52 μm, 15. K/min, 320. C @ 10. min; Tstart: 35. C
CapillaryDB-12208.Hoffmann, Aramaki, et al., 198930. m/0.53 mm/1. μm, He, 4. K/min; Tstart: 70. C; Tend: 290. C
CapillarySE-522218.Lefevere, Verhaeghe, et al., 198925. m/0.32 mm/0.52 μm, He, 5. K/min; Tstart: 70. C; Tend: 270. C
CapillaryCP Sil 5 CB2209.Wurth, Kumps, et al., 1989N2, 60. C @ 0.5 min, 6. K/min, 280. C @ 5. min
PackedOV-12208.Tanaka, Hine, et al., 1980N2, 100-120 mesh, 70. C @ 0.5 min, 28. K/min; Column length: 1.8 m; Tend: 290. C

Van Den Dool and Kratz RI, non-polar column, custom temperature program

View large format table.

Column type Active phase I Reference Comment
CapillaryVF-5MS2215.7Tret'yakov, 200730. m/0.25 mm/0.25 μm, He; Program: Multi-step temperature program; T(initial)=60C; T(final)=270C
CapillaryDB-12208.Tsai, Oliphant, et al., 1985He; Program: not specified
PackedOV-1012208.Tanaka and Hine, 1982Program: not specified

Normal alkane RI, non-polar column, temperature ramp

View large format table.

Column type Active phase I Reference Comment
CapillaryDB-5 MS2208.Yan, A., et al., 200910. m/0.18 mm/0.18 μm, Helium, 70. C @ 2. min, 35. K/min, 310. C @ 2. min
CapillaryHP-52224.Isidorov, Lech, et al., 200830. m/0.25 mm/0.25 μm, Helium, 3. K/min, 300. C @ 30. min; Tstart: 50. C
CapillaryHP-52220.Isidorov, Olchowik, et al., 200730. m/0.25 mm/0.25 μm, He, 5. K/min; Tstart: 50. C; Tend: 300. C
CapillaryHP-5MS2229.Lee, Yanamandra, et al., 200230. m/0.25 mm/0.25 μm, He, 70. C @ 3. min, 4. K/min, 280. C @ 3. min

Normal alkane RI, non-polar column, custom temperature program

View large format table.

Column type Active phase I Reference Comment
CapillaryMethylsiloxane, 5 % Ph groups2218.Cao, Aa, et al., 2011Program: not specified
CapillaryHP-52218.Isidorov, Lech, et al., 200830. m/0.25 mm/0.25 μm, Helium; Program: not specified
CapillaryRTx-5 Sil MS2217.Birkemeier and Kopka, 200730. m/0.25 mm/0.25 μm, Helium; Program: 70 0C (1 min) 1 0C/min -> 76 0C 6.09 0C/min -> 350 0C (1 min) -> 330 0C (10 min)

References

Richmond and Pombo-Villar, 1997
Richmond, R.; Pombo-Villar, E., Short communication. Gas chromatography-mass spectrometry coupled with pseudo-Sadtler retention indices, for the identification of components in the essential oil of Curcuma longa L., J. Chromatogr. A, 1997, 760, 2, 303-308, https://doi.org/10.1016/S0021-9673(96)00802-3 . [all data]

Hoffmann, Aramaki, et al., 1989
Hoffmann, G.; Aramaki, S.; Blum-Hoffmann, E.; Nyhan, W.L.; Sweetman, L., Quantitative analysis for organic acids in biological samples: batch isolation followed by gas chromatographic-mass spectrometric analysis, Clin. Chem., 1989, 35, 4, 587-595. [all data]

Lefevere, Verhaeghe, et al., 1989
Lefevere, M.F.; Verhaeghe, B.J.; Declerck, D.H.; Van Bocxlaer, J.F.; De Leenheer, A.P.; De Sagher, R.M., Metabolic Profiling of Urinary Organic Acids by Single and Multicolumn Capillary Gas Chromatography, J. Chromatogr. Sci., 1989, 27, 1, 23-29, https://doi.org/10.1093/chromsci/27.1.23 . [all data]

Wurth, Kumps, et al., 1989
Wurth, C.; Kumps, A.; Mardens, Y., Urinary organic acids: Retention indices on two capillary gas chromatography columns, J. Chromatogr., 1989, 491, 186-192, https://doi.org/10.1016/S0378-4347(00)82831-5 . [all data]

Tanaka, Hine, et al., 1980
Tanaka, K.; Hine, D.G.; West-Dull, A.; Lynn, T.B., Gas-chromatographic method of analysis for urinary organic acids. I. Retention indices of 155 metabolically important compounds, Clin. Chem., 1980, 26, 13, 1839-1846. [all data]

Tret'yakov, 2007
Tret'yakov, K.V., Retention Data. NIST Mass Spectrometry Data Center., NIST Mass Spectrometry Data Center, 2007. [all data]

Tsai, Oliphant, et al., 1985
Tsai, M.Y.; Oliphant, C.; Josephson, M.W., Identification of Metabolites Diagnostic for Organic Acidurias by Simultaneous Dual-Column Capillary Gas Chromatography, J. Chromatogr., 1985, 341, 1-10, https://doi.org/10.1016/S0378-4347(00)84004-9 . [all data]

Tanaka and Hine, 1982
Tanaka, K.; Hine, D.G., Compilation of Gas Chromatographic Retention Indices of 163 Metabolically Important Organic Acids, and Their Use in Detection of Patients with Organic Acidurias, J. Chromatogr., 1982, 239, 301-322, https://doi.org/10.1016/S0021-9673(00)81990-1 . [all data]

Yan, A., et al., 2009
Yan, B.; A.; Wang, G.; Lu, H.; Huang, X.; Liu, Y.; Zha, W.; Hao, H.; Zhang, Y.; Liu, L.; Gu, S.; Huang, Q.; Zheng, Y.; Sun, J., Metabolomic investigation into variation of endogenous metabolites in professional athletes subject to strength-endurance training, J. Appl. Physiol., 2009, 106, 2, 531-538, https://doi.org/10.1152/japplphysiol.90816.2008 . [all data]

Isidorov, Lech, et al., 2008
Isidorov, V.A.; Lech, P.; Zolciak, A.; Rusak, N.; Szczepaniak, L., Gas Chromatographic - nass spectrometric investigation of metabolites from the needles and roots of pine seedlings at early stages of pathogenic fungi Armillaria ostoyae attack, Trees, 2008, 22, 4, 531-542, https://doi.org/10.1007/s00468-008-0213-z . [all data]

Isidorov, Olchowik, et al., 2007
Isidorov, V.A.; Olchowik, E.; Vinogorova, V.T., Simplified extraction procedure and gas chromatographic determination of acid compounds in plant material, Chemia Analityczna, 2007, 52, 3, 423-433. [all data]

Lee, Yanamandra, et al., 2002
Lee, B.Y.; Yanamandra, K.; Thurmon, T.F., Quantitative estimation of organic analytes with a capillary column, Am. Clin. Lab., 2002, May, 30-34. [all data]

Cao, Aa, et al., 2011
Cao, B.; Aa, J.; Wang, G.; Wu, X.; Liu, L.; Li, M.; Shi, J.; Wang, X.; Zhao, C.; Zheng, T.; Guo, S.; Duan, J., GC-TOFMS analysis of metabolites in adherent MDCK cells and a movel strategy for identifying intracellular metabolic markers for use as cell amount indicators in data normalization, Anal. Bioanal. Chem., 2011, 400, 9, 2983-2993, https://doi.org/10.1007/s00216-011-4981-8 . [all data]

Birkemeier and Kopka, 2007
Birkemeier, C.; Kopka, J., Design of metabolite recovery by variations of the metabolite profiling protocol in Concepts in Plant Metabolomics, Nikolau, B.J.; Wurtele, E.S., ed(s)., Springer, Dordrecht, Netheralnds, 2007, 45-69. [all data]