1,2:3,4:6,7-Tribenzophenazine

Gas phase ion energetics data

Data compiled by: Henry M. Rosenstock, Keith Draxl, Bruce W. Steiner, and John T. Herron

Ionization energy determinations

IE (eV) Method Reference
7.8 ± 0.1EIGallegos, 1968

References

Gallegos, 1968
Gallegos, E.J., Mass spectrometry and ionization energies of some condensed-ring aromatic and heterocyclic compounds, J. Phys. Chem., 1968, 72, 3452. [all data]