Benzoic acid, 3,4-dihydroxy-, methyl ester

Van Den Dool and Kratz RI, non-polar column, custom temperature program

View large format table.

Column type Active phase I Reference Comment
CapillaryVF-5MS1696.9Tret'yakov, 200830. m/0.25 mm/0.25 μm, He; Program: Multi-step temperature program; T(initial)=60C; T(final)=270C

Normal alkane RI, non-polar column, temperature ramp

View large format table.

Column type Active phase I Reference Comment
CapillaryDB-51684.Güntert, Rapp, et al., 198630. m/0.25 mm/0.25 μm, He, 2. K/min; Tstart: 40. C; Tend: 250. C

References

Tret'yakov, 2008
Tret'yakov, K.V., Retention Data. NIST Mass Spectrometry Data Center., NIST Mass Spectrometry Data Center, 2008. [all data]

Güntert, Rapp, et al., 1986
Güntert, M.; Rapp, A.; Takeoka, G.R.; Jennings, W., HRGC and HRGC-MS applied to wine constituents of lower volatility, Z. Lebensm. Unters. Forsch., 1986, 182, 3, 200-204, https://doi.org/10.1007/BF01042128 . [all data]