SiF5-

Vibrational and/or electronic energy levels

Data compiled by: Marilyn E. Jacox

State:   X

Vib.
sym.
 No.   Approximate
 type of mode
 cm-1   Med.   Method   References

Ax. SiF stretch 932 vs Cs Ar IR Ault, 1979
Eq. SiF stretch 855 s Cs Ar IR Ault, 1979
Br. SiF stretch 812 vs Cs Ar IR Ault, 1979
Deform. 480 s Cs Ar IR Ault, 1979
Deform. 457 w m Cs Ar IR Ault, 1979
Deform. 444 w m Cs Ar IR Ault, 1979

Additional references: Jacox, 1994, page 357

References

Ault, 1979
Ault, B.S., Infrared matrix isolation studies of the M+SiF5- ion pair and its chlorine-fluorine analogs, Inorg. Chem., 1979, 18, 12, 3339, https://doi.org/10.1021/ic50202a012 . [all data]

Jacox, 1994
Jacox, M.E., Vibrational and electronic energy levels of polyatomic transient molecules, American Chemical Society, Washington, DC, 1994, 464. [all data]