Dibenzo[de,mn]naphthacene

Gas phase thermochemistry data

Data compiled by: Glushko Thermocenter, Russian Academy of Sciences, Moscow

Constant pressure heat capacity of gas

Cp,gas (J/mol*K) Temperature (K) Reference Comment
55.9250.Dorofeeva O.V., 1988Recommended values were calculated statistically mechanically using force field approximation for polycyclic aromatic hydrocarbons to estimate the needed vibrational frequencies (see also [ Dorofeeva O.V., 1986, Moiseeva N.F., 1989]). These functions are reproduced in the reference book [ Frenkel M., 1994].
94.86100.
141.36150.
193.71200.
274.91273.15
302.6 ± 4.0298.15
304.58300.
407.64400.
493.43500.
561.95600.
616.53700.
660.51800.
696.46900.
726.181000.
751.021100.
771.921200.
789.651300.
804.771400.
817.741500.

References

Dorofeeva O.V., 1988
Dorofeeva O.V., Thermodynamic Properties of Polycyclic Aromatic Hydrocarbons in the Gaseous Phase. Institute for High Temperatures, USSR Academy of Sciences, Preprint No.1-238 (in Russian), Moscow, 1988. [all data]

Dorofeeva O.V., 1986
Dorofeeva O.V., On calculation of thermodynamic properties of polycyclic aromatic hydrocarbons, Thermochim. Acta, 1986, 102, 59-66. [all data]

Moiseeva N.F., 1989
Moiseeva N.F., Development of Benson group additivity method for estimation of ideal gas thermodynamic properties of polycyclic aromatic hydrocarbons, Thermochim. Acta, 1989, 153, 77-85. [all data]

Frenkel M., 1994
Frenkel M., Thermodynamics of Organic Compounds in the Gas State, Vol. I, II, Thermodynamics Research Center, College Station, Texas, 1994, 1994. [all data]