Heptasulfur

Gas phase thermochemistry data

Quantity Value Units Method Reference Comment
gas,1 bar407.67J/mol*KReviewChase, 1998Data last reviewed in September, 1977

Gas Phase Heat Capacity (Shomate Equation)

Cp° = A + B*t + C*t2 + D*t3 + E/t2
H° − H°298.15= A*t + B*t2/2 + C*t3/3 + D*t4/4 − E/t + F − H
S° = A*ln(t) + B*t + C*t2/2 + D*t3/3 − E/(2*t2) + G
    Cp = heat capacity (J/mol*K)
    H° = standard enthalpy (kJ/mol)
    S° = standard entropy (J/mol*K)
    t = temperature (K) / 1000.

View plot Requires a JavaScript / HTML 5 canvas capable browser.

View table.

Temperature (K) 298. - 6000.
A 154.9674
B 2.564655
C 0.000048
D -0.000005
E -1.976092
F -52.94559
G 583.3291
H 0.000000
ReferenceChase, 1998
Comment Data last reviewed in September, 1977

Gas phase ion energetics data

Data compiled as indicated in comments:
LBLHLM - Sharon G. Lias, John E. Bartmess, Joel F. Liebman, John L. Holmes, Rhoda D. Levin, and W. Gary Mallard
RDSH - Henry M. Rosenstock, Keith Draxl, Bruce W. Steiner, and John T. Herron
B - John E. Bartmess

Electron affinity determinations

EA (eV) Method Reference Comment
3.160 ± 0.050LPDHunsicker, Jones, et al., 1995Vertical Detachment Energy: 3.55 eV. An isomer exists with EA=2.26 eV; B

Ionization energy determinations

IE (eV) Method Reference Comment
9.0 ± 0.2EIRosinger, Grade, et al., 1983LBLHLM
8.7 ± 0.2EIDrowart, Goldfinger, et al., 1968RDSH
8.67 ± 0.03PIBerkowitz and Lifshitz, 1968RDSH
9.3 ± 0.3EIBerkowitz and Chupka, 1964RDSH

References

Chase, 1998
Chase, M.W., Jr., NIST-JANAF Themochemical Tables, Fourth Edition, J. Phys. Chem. Ref. Data, Monograph 9, 1998, 1-1951. [all data]

Hunsicker, Jones, et al., 1995
Hunsicker, S.; Jones, R.O.; Gantefor, G., Rings and chains in sulfur cluster anions S- to S-9(-): Theory (simulated annealing) and experiment (photoelectron detachment), J. Chem. Phys., 1995, 102, 15, 5917, https://doi.org/10.1063/1.469326 . [all data]

Rosinger, Grade, et al., 1983
Rosinger, W.; Grade, M.; Hirschwald, W., Detection of ion states of S2 to S8 by electron impact, Int. J. Mass Spectrom. Ion Processes, 1983, 47, 239. [all data]

Drowart, Goldfinger, et al., 1968
Drowart, J.; Goldfinger, P.; Detry, D.; Rickert, H.; Keller, H., Mass spectrometric study of the equilibria in sulphur vapour generated by an electrochemical knudsen cell, Advan. Mass Spectrom., 1968, 4, 499. [all data]

Berkowitz and Lifshitz, 1968
Berkowitz, J.; Lifshitz, C., Photoionization of high temperature vapors. II. Sulfur molecular species, J. Chem. Phys., 1968, 48, 4346. [all data]

Berkowitz and Chupka, 1964
Berkowitz, J.; Chupka, W.A., Vaporization processes involving sulfur, J. Chem. Phys., 1964, 40, 287. [all data]