2,6-Octadien-1-ol, 3,7-dimethyl-, formate, (Z)-

Van Den Dool and Kratz RI, non-polar column, temperature ramp

Data compiled by: NIST Mass Spectrometry Data Center, William E. Wallace, director

Column type CapillaryCapillaryCapillaryCapillaryCapillary
Active phase RSL-200BP-1CP Sil 5 CBMethyl SiliconeDB-1
Column length (m) 30.30.25.25.60.
Carrier gas H2N2HeHeHe
Substrate
Column diameter (mm) 0.320.320.250.20.25
Phase thickness (μm) 0.250.25 0.30.25
Tstart (C) 40.60.60.40.70.
Tend (C) 280.220.260.200.250.
Heat rate (K/min) 6.5.5.2.2.5
Initial hold (min) 5.   5.
Final hold (min) 5.13.  15.
I 1280.1272.1266.1267.1265.
ReferenceNgassoum, Ousmaila, et al., 2004Raina, Kumar, et al., 2004Weyerstahl, Marschall, et al., 1999Píry, Príbela, et al., 1995Combariza, Tirado, et al., 1994
Comment MSDC-RI MSDC-RI MSDC-RI MSDC-RI MSDC-RI

Normal alkane RI, non-polar column, temperature ramp

Data compiled by: NIST Mass Spectrometry Data Center, William E. Wallace, director

Column type CapillaryCapillaryCapillaryCapillary
Active phase HP-5BP-1DB-1HP-101
Column length (m) 30.50.30.50.
Carrier gas HeliumHelium H2
Substrate
Column diameter (mm) 0.320.220.320.32
Phase thickness (μm) 0.250.250.250.3
Tstart (C) 60.60.60.65.
Tend (C) 240.220.230.300.
Heat rate (K/min) 3.2.3.2.
Initial hold (min) 2. 3.5.
Final hold (min)  20.10.
I 1284.1263.1267.1259.
ReferenceKahriman, Tosun, et al., 2011Ottavioli, Bighelli, et al., 2009Tohar, Mohd, et al., 2006Demarne and van der Walt, 1993
Comment MSDC-RI MSDC-RI MSDC-RI MSDC-RI

Phase change data

Data compiled by: William E. Acree, Jr., James S. Chickos

Enthalpy of vaporization

ΔvapH (kJ/mol) Temperature (K) Method Reference Comment
58.1345.AStephenson and Malanowski, 1987Based on data from 330. - 498. K.

Normal alkane RI, non-polar column, custom temperature program

Data compiled by: NIST Mass Spectrometry Data Center, William E. Wallace, director

Column type CapillaryCapillaryCapillaryCapillary
Active phase HP-5SE-305 % Phenyl methyl siloxaneOV-101
Column length (m) 30.
Carrier gas Helium
Substrate
Column diameter (mm) 0.32
Phase thickness (μm) 0.25
Program not specifiednot specifiednot specifiednot specified
I 1282.1267.1268.1267.
ReferenceKahriman, Tosun, et al., 2011Vinogradov, 2004Sagrero-Nieves and Bartley, 1995Shibamoto, 1987
Comment MSDC-RI MSDC-RI MSDC-RI MSDC-RI

References

Ngassoum, Ousmaila, et al., 2004
Ngassoum, M.B.; Ousmaila, H.; Ngamo, L.T.; Maponmetsem, P.M.; Jirovetz, L.; Buchbauer, G., Aroma compounds of essential oils of two varieties of the spice plant Ocimum canum Sims from northern Cameroon, J. Food Comp. Anal., 2004, 17, 2, 197-204, https://doi.org/10.1016/j.jfca.2003.08.002 . [all data]

Raina, Kumar, et al., 2004
Raina, V.K.; Kumar, A.; Srivastava, S.K.; Syamsundar, K.V.; Kahol, A.P., Essential oil composition of 'kewda' (Pandanus odoratissimus) from India, Flavour Fragr. J., 2004, 19, 5, 434-436, https://doi.org/10.1002/ffj.1331 . [all data]

Weyerstahl, Marschall, et al., 1999
Weyerstahl, P.; Marschall, H.; Wahlburg, H.-C.; Christiansen, C.; Rustaiyan, A.; Mirdjalili, F., Constituents of the essential oil of Pulicaria gnaphalodes (Vent.) Boiss. from Iran, Flavour Fragr. J., 1999, 14, 2, 121-130, https://doi.org/10.1002/(SICI)1099-1026(199903/04)14:2<121::AID-FFJ790>3.0.CO;2-K . [all data]

Píry, Príbela, et al., 1995
Píry, J.; Príbela, A.; Durcanská, J.; Farkas, P., Fractionation of volatiles from blackcurrant (Ribes nigrum L.) by different extractive methods, Food Chem., 1995, 54, 1, 73-77, https://doi.org/10.1016/0308-8146(95)92665-7 . [all data]

Combariza, Tirado, et al., 1994
Combariza, M.Y.; Tirado, C.B.; Stashenko, E.; Shibamoto, T., Limonene concentration in lemon (Citrus volkameriana) peel oil as a function of ripeness, J. Hi. Res. Chromatogr., 1994, 17, 9, 643-646, https://doi.org/10.1002/jhrc.1240170905 . [all data]