Dehydroabietic acid, TMS derivative

Normal alkane RI, non-polar column, temperature ramp

Data compiled by: NIST Mass Spectrometry Data Center, William E. Wallace, director

Column type CapillaryCapillary
Active phase HP-5HP-5
Column length (m) 30.30.
Carrier gas HeliumHe
Substrate
Column diameter (mm) 0.250.25
Phase thickness (μm) 0.250.25
Tstart (C) 50.50.
Tend (C) 300.300.
Heat rate (K/min) 3.5.
Initial hold (min)
Final hold (min) 30.
I 2385.2373.
ReferenceIsidorov, Lech, et al., 2008Isidorov, Olchowik, et al., 2007
Comment MSDC-RI MSDC-RI

References

Isidorov, Lech, et al., 2008
Isidorov, V.A.; Lech, P.; Zolciak, A.; Rusak, N.; Szczepaniak, L., Gas Chromatographic - nass spectrometric investigation of metabolites from the needles and roots of pine seedlings at early stages of pathogenic fungi Armillaria ostoyae attack, Trees, 2008, 22, 4, 531-542, https://doi.org/10.1007/s00468-008-0213-z . [all data]

Isidorov, Olchowik, et al., 2007
Isidorov, V.A.; Olchowik, E.; Vinogorova, V.T., Simplified extraction procedure and gas chromatographic determination of acid compounds in plant material, Chemia Analityczna, 2007, 52, 3, 423-433. [all data]