α-Calacorene

Normal alkane RI, non-polar column, temperature ramp

Data compiled by: NIST Mass Spectrometry Data Center, William E. Wallace, director

Column type CapillaryCapillaryCapillaryCapillaryCapillary
Active phase HP-5 MSDB-5HP-5DB-5HP-5
Column length (m) 30.30.30.30.30.
Carrier gas HeliumHeliumNitrogenHeliumHelium
Substrate
Column diameter (mm) 0.250.250.250.250.25
Phase thickness (μm) 0.250.250.250.250.25
Tstart (C) 60.60.50.50.50.
Tend (C) 220.240.280.250.240.
Heat rate (K/min) 4.3.5.2.3.
Initial hold (min) 20. 1. 5.
Final hold (min) 20. 1.
I 1542.1542.1542.1546.1545.
ReferenceFeizbakhsh and Naeemy, 2011Karimi, Farmani, et al., 2011Tekaya-Karoui, Boughalleb, et al., 2011Ho, Wang, et al., 2010Monsef-Esfahani, Miri, et al., 2010
Comment MSDC-RI MSDC-RI MSDC-RI MSDC-RI MSDC-RI
Column type CapillaryCapillaryCapillaryCapillaryCapillary
Active phase HP-5 MSHP-5HP-5 MSDB-5 MSDB-5
Column length (m) 30.30.30.30.30.
Carrier gas HeliumHydrogenHeliumHeliumHelium
Substrate
Column diameter (mm) 0.250.250.250.250.25
Phase thickness (μm) 0.250.250.250.250.25
Tstart (C) 70.70.70.60.40.
Tend (C) 290.290.290.240.240.
Heat rate (K/min) 5.5.5.3.3.
Initial hold (min)     1.
Final hold (min) 10. 10.
I 1550.1552.1544.1541.1520.
ReferenceRadulovic, Blagojevic, et al., 2010Radulovic, Dordevic, et al., 2010Radulovic, Dordevic, et al., 2010, 2Silva, Pott, et al., 2010de Souza, Lopes, et al., 2010
Comment MSDC-RI MSDC-RI MSDC-RI MSDC-RI MSDC-RI
Column type CapillaryCapillaryCapillaryCapillaryCapillary
Active phase DB-5DB-5RTX-1RTX-15 % Phenyl methyl siloxane
Column length (m) 30.30.60.60.60.
Carrier gas HeliumHeliumHeliumHeliumHelium
Substrate
Column diameter (mm) 0.250.250.220.220.25
Phase thickness (μm) 0.250.250.250.250.25
Tstart (C) 40.50.60.60.90.
Tend (C) 250.250.230.230.225.
Heat rate (K/min) 10.5.2.2.3.
Initial hold (min) 1.2.
Final hold (min) 3. 30.30.3.
I 1546.1546.1527.1531.1545.
ReferenceYang, Zhang, et al., 2010Ho, Wang, et al., 2009Museli, Pau, et al., 2009Museli, Pau, et al., 2009Retta, Gattuso, et al., 2009
Comment MSDC-RI MSDC-RI MSDC-RI MSDC-RI MSDC-RI
Column type CapillaryCapillaryCapillaryCapillaryCapillary
Active phase DB-5DB-5DB-5HP-5 MSSE-52
Column length (m) 30.50.30.30.50.
Carrier gas NitrogenNitrogenHelium Helium
Substrate
Column diameter (mm) 0.250.200.250.250.25
Phase thickness (μm) 0.250.320.25 0.25
Tstart (C) 40.60.40.60.60.
Tend (C) 230.220.240.280.280.
Heat rate (K/min) 2.5.3.3.3.
Initial hold (min)  3.1.
Final hold (min)  5.  20.
I 1546.1542.1520.1542.1552.
ReferenceScrivanti, Anton, et al., 2009Shafaghat and Sadeghi, 2009de Souza, Lopes, et al., 2009Baziou, Couladis, et al., 2008Djarri, Medjroubi, et al., 2008
Comment MSDC-RI MSDC-RI MSDC-RI MSDC-RI MSDC-RI
Column type CapillaryCapillaryCapillaryCapillaryCapillary
Active phase VF-5MSHP-5ZB-1DB-5 MSRTX-1
Column length (m) 30.30.30.30.60.
Carrier gas HeliumHeliumNitrogenHeliumHe
Substrate
Column diameter (mm) 0.250.320.250.250.22
Phase thickness (μm) 0.250.250.250.250.25
Tstart (C) 240.100.45.50.60.
Tend (C) 320.240.230.300.230.
Heat rate (K/min) 20.5.3.5.2.
Initial hold (min) 1.2. 5.
Final hold (min)  5. 5.35.
I 1548.1542.1526.1537.1539.
ReferenceKowalski, 2008Lago, Romoff, et al., 2008Mierendorff, Stahl-Biskup, et al., 2008Noudogbessi, Yedomonhan, et al., 2008Paolini, Tomi, et al., 2008
Comment MSDC-RI MSDC-RI MSDC-RI MSDC-RI MSDC-RI
Column type CapillaryCapillaryCapillaryCapillaryCapillary
Active phase SLB-5MSHP-5 MSHP-5DB-5HP-5
Column length (m) 10.30.30.30.30.
Carrier gas HeliumHeliumHeliumHeN2
Substrate
Column diameter (mm) 0.180.250.250.260.25
Phase thickness (μm) 0.180.250.320.250.25
Tstart (C) 40.50.60.60.50.
Tend (C) 295.240.250.240.240.
Heat rate (K/min) 10.3.5.3.5.
Initial hold (min) 1.5 30. 1.
Final hold (min)     4.
I 1541.1584.1545.1540.1542.
ReferenceRisticevic, Carasek, et al., 2008Sarikurkcu, Tepe, et al., 2008Yassa and Akhani, 2008Bos, Woerdenbag, et al., 2007Cheraif, Ben Jannet, et al., 2007
Comment MSDC-RI MSDC-RI MSDC-RI MSDC-RI MSDC-RI
Column type CapillaryCapillaryCapillaryCapillaryCapillary
Active phase DB-5HP-5HP-5MSHP-1DB-1
Column length (m) 30.30.30.30.50.
Carrier gas HeliumHeliumHeHeHe
Substrate
Column diameter (mm) 0.260.250.250.250.25
Phase thickness (μm) 0.250.260.250.250.25
Tstart (C) 60.60.60.60.95.
Tend (C) 290.240.250.240.240.
Heat rate (K/min) 3.4.2.2.4.
Initial hold (min)  2.8.
Final hold (min)  20.15.20.
I 1540.1546.1536.1514.1538.
ReferenceElfami, Bos, et al., 2007Farsam, Amanlou, et al., 2007Ferhat, Tigrine-Kordjani, et al., 2007Hachicha, Skanji, et al., 2007Pala-Paul, Brophy, et al., 2007
Comment MSDC-RI MSDC-RI MSDC-RI MSDC-RI MSDC-RI
Column type CapillaryCapillaryCapillaryCapillaryCapillary
Active phase HP-5 MSHP-5MSHP-5DB-5DB-5
Column length (m) 30.30.30.30.30.
Carrier gas HeliumHeHeHe
Substrate
Column diameter (mm) 0.250.250.250.250.25
Phase thickness (μm) 0.250.250.320.250.25
Tstart (C) 60.40.60.60.60.
Tend (C) 280.250.250.300.300.
Heat rate (K/min) 3.3.5.3.3.
Initial hold (min)  5.30.
Final hold (min)  10.
I 1546.1519.1545.1526.1537.
ReferenceVagionas, Graikou, et al., 2007Vichi, Riu-Aumatell, et al., 2007Yassa and Akhani, 2007Apel, Sobral, et al., 2006Apel, Sobral, et al., 2006, 2
Comment MSDC-RI MSDC-RI MSDC-RI MSDC-RI MSDC-RI
Column type CapillaryCapillaryCapillaryCapillaryCapillary
Active phase HP-5DB-1DB-5HP-5HP-1
Column length (m) 25.60.30.30.50.
Carrier gas HeNitrogenHeliumHeHe
Substrate
Column diameter (mm) 0.250.250.260.250.2
Phase thickness (μm) 0.25 0.250.250.33
Tstart (C) 50.40.60.50.60.
Tend (C) 300.200.290.300.250.
Heat rate (K/min) 5.2.3.5.2.
Initial hold (min) 5.1. 5.
Final hold (min)  9. 5.40.
I 1527.1523.1540.1541.1524.
ReferenceChampagnat, Figueredo, et al., 2006Chen, Sheu, et al., 2006Elfami, Komar, et al., 2006Figuérédo, Cabassu, et al., 2006Filippi, Lanfranchi, et al., 2006
Comment MSDC-RI MSDC-RI MSDC-RI MSDC-RI MSDC-RI
Column type CapillaryCapillaryCapillaryCapillaryCapillary
Active phase DB-5DB-5DB-5HP-5BP-1
Column length (m) 30.30.30.30.50.
Carrier gas HeHeHeliumHeliumHe
Substrate
Column diameter (mm) 0.250.250.250.320.22
Phase thickness (μm) 0.250.250.250.250.25
Tstart (C) 60.60.60.60.60.
Tend (C) 240.240.260.260.220.
Heat rate (K/min) 5.5.3.5.2.
Initial hold (min) 2.2. 2.
Final hold (min)    13.20.
I 1542.1542.1540.1546.1532.
ReferenceGohari, Hadjiakhoondi, et al., 2006Gohari A.R., Hadjiakhoondi A., et al., 2006Javidnia, Miri, et al., 2006Kucuk, Gulec, et al., 2006Lesueur, Ban, et al., 2006
Comment MSDC-RI MSDC-RI MSDC-RI MSDC-RI MSDC-RI
Column type CapillaryCapillaryCapillaryCapillaryCapillary
Active phase DB-5DB-1SPB-5DB-5DB-5
Column length (m) 30.50.30.30.30.
Carrier gas HeN2HeliumHydrogenHydrogen
Substrate
Column diameter (mm) 0.250.250.250.250.25
Phase thickness (μm) 0.250.250.250.250.25
Tstart (C) 60.95.60.70.70.
Tend (C) 220.240.250.280.280.
Heat rate (K/min) 4.4.4.4.4.
Initial hold (min) 5. 2.4.4.
Final hold (min)   20.
I 1548.1550.1540.1542.1542.
ReferenceMorteza-Semnani K., Saeedi M., et al., 2006Pala-Paul J., Perez-Alonso M.J., et al., 2006Pino, Marquez, et al., 2006Pino, Marbot, et al., 2006Pino, Marbot, et al., 2006
Comment MSDC-RI MSDC-RI MSDC-RI MSDC-RI MSDC-RI
Column type CapillaryCapillaryCapillaryCapillaryCapillary
Active phase DB-5HP-5MSHP-5MSDB-5DB-5
Column length (m) 30.30.30.30.30.
Carrier gas HydrogenHeHeHeHe
Substrate
Column diameter (mm) 0.250.250.250.250.25
Phase thickness (μm) 0.250.250.250.250.25
Tstart (C) 70.60.60.60.60.
Tend (C) 280.280.275.240.240.
Heat rate (K/min) 4.3.4.3.3.
Initial hold (min) 4.
Final hold (min)
I 1542.1512.1545.1544.1543.
ReferencePino, Marbot, et al., 2006Pitarokili, Tzakou, et al., 2006Asadipour, Mehrabani, et al., 2005Chaverri and Cicció, 2005Chaverri and Cicció, 2005
Comment MSDC-RI MSDC-RI MSDC-RI MSDC-RI MSDC-RI
Column type CapillaryCapillaryCapillaryCapillaryCapillary
Active phase DB-5HP-1HP-5HP-5MSDB-5
Column length (m) 30.50.30.30.30.
Carrier gas He HeHe
Substrate
Column diameter (mm) 0.250.20.250.250.25
Phase thickness (μm) 0.250.250.250.250.25
Tstart (C) 60.60.60.60.35.
Tend (C) 300.250.30.200.280.
Heat rate (K/min) 3.2.4.4.4.
Initial hold (min) 3.60.3.30.2.
Final hold (min)   15.
I 1536.1531.1546.1533.1548.
ReferenceFerraz, Limberger, et al., 2005Fernandez, Lizzani-Cuvelier, et al., 2005Ferretti, Maggi, et al., 2005Gauvin and Smadja, 2005Kowalski and Wolski, 2005
Comment MSDC-RI MSDC-RI MSDC-RI MSDC-RI MSDC-RI
Column type CapillaryCapillaryCapillaryCapillaryCapillary
Active phase DB-5MSDB-5DB-5DB-1HP-5MS
Column length (m) 30.30.30.50.30.
Carrier gas HeHeHeN2He
Substrate
Column diameter (mm) 0.250.250.250.250.25
Phase thickness (μm) 0.250.250.250.250.25
Tstart (C) 60.60.60.95.60.
Tend (C) 280.220.220.240.275.
Heat rate (K/min) 3.4.4.4.4.
Initial hold (min) 30.5.4.
Final hold (min)
I 1512.1546.1548.1538.1539.
ReferenceMarongiu, Piras, et al., 2005Morteza-Semnani, Akbarzadeh, et al., 2005Morteza-Semnani and Saeedi, 2005Pala-Paul, Perez-Alonso, et al., 2005Sajjadi and Ghannadi, 2005
Comment MSDC-RI MSDC-RI MSDC-RI MSDC-RI MSDC-RI
Column type CapillaryCapillaryCapillaryCapillaryCapillary
Active phase DB-5HP-5MSHP-5DB-5BP-1
Column length (m) 30.30.30.30.50.
Carrier gas He HeH2
Substrate
Column diameter (mm) 0.250.250.320.250.22
Phase thickness (μm) 0.250.250.250.250.25
Tstart (C) 40.40.60.50.60.
Tend (C) 260.220.260.290.220.
Heat rate (K/min) 2.3.5.4.2.
Initial hold (min) 5.5.2.
Final hold (min) 20.10.13. 20.
I 1540.1519.1546.1537.1539.
ReferenceSenatore, Apostolides Arnold, et al., 2005Vichi, Riu-Aumatell, et al., 2005Yayli, Yasar, et al., 2005Abreu, Reis, et al., 2004Blanc, Muselli, et al., 2004
Comment MSDC-RI MSDC-RI MSDC-RI MSDC-RI MSDC-RI
Column type CapillaryCapillaryCapillaryCapillaryCapillary
Active phase DB-1DB-5RTX-1DB-5DB-5
Column length (m) 30.30.30.30.50.
Carrier gas N2HeN2HeliumHelium
Substrate
Column diameter (mm) 0.250.250.320.250.25
Phase thickness (μm) 0.250.250.25
Tstart (C) 50.60.60.60.60.
Tend (C) 200.300.300.240.240.
Heat rate (K/min) 5.3.4.2.2.
Initial hold (min)
Final hold (min)    999.999.
I 1529.1533.1525.1534.1534.
ReferenceFekam Boyom, Fotio, et al., 2004Limberger, Sobral, et al., 2004Lis, Boczek, et al., 2004Miyazawa, Fuhita, et al., 2004Miyazawa, Fujita, et al., 2004
Comment MSDC-RI MSDC-RI MSDC-RI MSDC-RI MSDC-RI
Column type CapillaryCapillaryCapillaryCapillaryCapillary
Active phase DB-5HP-5DB-5HP-5MSHP-5
Column length (m) 30.25.30.30.30.
Carrier gas HeH2HeHeHe
Substrate
Column diameter (mm) 0.250.320.2490.250.25
Phase thickness (μm) 0.250.520.250.250.25
Tstart (C) 35.40.60.60.60.
Tend (C) 220.240.300.280.280.
Heat rate (K/min) 3.4.3.4.4.
Initial hold (min)
Final hold (min)
I 1543.1542.1541.1542.1529.
ReferencePalá-Paúl, Brophy, et al., 2004Simic, Sokovic, et al., 2004Woerdenbag, Windono, et al., 2004Ghasemi, Asghari, et al., 2003Ghassemi, Sajjadi, et al., 2003
Comment MSDC-RI MSDC-RI MSDC-RI MSDC-RI MSDC-RI
Column type CapillaryCapillaryCapillaryCapillaryCapillary
Active phase DB-5DB-5MSDB-5DB-5ZB-1
Column length (m) 30.30.30.30.30.
Carrier gas HeHeHeHeN2
Substrate
Column diameter (mm) 0.250.250.250.250.25
Phase thickness (μm) 0.250.250.250.250.25
Tstart (C) 60.60.60.60.45.
Tend (C) 250.240.280.280.230.
Heat rate (K/min) 3.3.3.3.3.
Initial hold (min)
Final hold (min)   30.30.
I 1536.1543.1531.1530.1526.
ReferenceLimberger, Simões-Pires, et al., 2003Maia, Taveira, et al., 2003Marongiu, Porcedda, et al., 2003Marongiu, Porcedda, et al., 2003Mierendorff, Stahl-Biskup, et al., 2003
Comment MSDC-RI MSDC-RI MSDC-RI MSDC-RI MSDC-RI
Column type CapillaryCapillaryCapillaryCapillaryCapillary
Active phase DB-5DB-5HP-5HP-5HP-5
Column length (m) 30.30.30.60.25.
Carrier gas H2H2He H2
Substrate
Column diameter (mm) 0.250.250.250.250.32
Phase thickness (μm) 0.250.250.250.250.53
Tstart (C) 60.60.60.40.40.
Tend (C) 280.280.280.250.280.
Heat rate (K/min) 4.4.3.5.4.
Initial hold (min) 10.10. 15.
Final hold (min) 40.40.
I 1542.1542.1521.1540.1537.
ReferencePino, Marbot, et al., 2003Pino, Marbot, et al., 2003Pitarokili, Tzakou, et al., 2003Stashenko, Jaramillo, et al., 2003Velickovic, Randjelovic, et al., 2003
Comment MSDC-RI MSDC-RI MSDC-RI MSDC-RI MSDC-RI
Column type CapillaryCapillaryCapillaryCapillaryCapillary
Active phase HP-5HP-5HP-5HP-5HP-5
Column length (m) 25.25.25.25.25.
Carrier gas H2HeliumHeliumHeliumHelium
Substrate
Column diameter (mm) 0.320.320.320.320.32
Phase thickness (μm) 0.530.530.530.530.53
Tstart (C) 40.40.40.40.40.
Tend (C) 280.280.280.280.280.
Heat rate (K/min) 4.4.4.4.4.
Initial hold (min)
Final hold (min)
I 1546.1539.1539.1540.1546.
ReferenceVelickovic, Randjelovic, et al., 2003Velickovic, Ristic, et al., 2003Velickovic, Ristic, et al., 2003Velickovic, Ristic, et al., 2003Velickovic, Ristic, et al., 2003
Comment MSDC-RI MSDC-RI MSDC-RI MSDC-RI MSDC-RI
Column type CapillaryCapillaryCapillaryCapillaryCapillary
Active phase DB-5OV-101DB-55 % Phenyl methyl siloxaneDB-5MS
Column length (m) 30.25.30.30.30.
Carrier gas He HeHeHe
Substrate
Column diameter (mm) 0.250.320.250.250.25
Phase thickness (μm) 0.25 0.250.250.25
Tstart (C) 60.50.60.75.60.
Tend (C) 240.200.280.200.280.
Heat rate (K/min) 3.5.3.3.3.
Initial hold (min)    4.
Final hold (min)   30.8.
I 1545.1532.1531.1546.1540.
ReferenceZoghbi, Andrade, et al., 2003Boyom, Keumedjio, et al., 2002Caredda, Marongiu, et al., 2002Cicció and Gómez-Laurito, 2002Congiu, Falconieri, et al., 2002
Comment MSDC-RI MSDC-RI MSDC-RI MSDC-RI MSDC-RI
Column type CapillaryCapillaryCapillaryCapillaryCapillary
Active phase DB-5MSPTE-5DB-5DB-5DB-5
Column length (m) 30.60.30.30.30.
Carrier gas HeH2 HeHe
Substrate
Column diameter (mm) 0.250.320.250.250.25
Phase thickness (μm) 0.250.300.250.250.25
Tstart (C) 60.60.40.60.35.
Tend (C) 280.285.210.240.280.
Heat rate (K/min) 3.4.32.3.3.
Initial hold (min)   2. 2.
Final hold (min)   33. 15.
I 1540.1542.1545.1542.1553.
ReferenceCongiu, Falconieri, et al., 2002Gudzic, Djokovic, et al., 2002Kabouss, Charrouf, et al., 2002Kobaisy, Tellez, et al., 2002Krauze-Baranowska, Mardarowicz, et al., 2002
Comment MSDC-RI MSDC-RI MSDC-RI MSDC-RI MSDC-RI
Column type CapillaryCapillaryCapillaryCapillaryCapillary
Active phase HP-5DB-5DB-5DB-5MSDB-5
Column length (m) 30.25.30.30.30.
Carrier gas  N2HeHeHe
Substrate
Column diameter (mm) 0.250.230.250.250.25
Phase thickness (μm) 0.250.150.250.250.25
Tstart (C) 60.50.60.60.60.
Tend (C) 275.250.240.240.220.
Heat rate (K/min) 4.3.3.3.4.
Initial hold (min) 4.   5.
Final hold (min)
I 1534.1542.1544.1545.1546.
ReferenceLockwood, Asghari, et al., 2002Mahmout, Bessière, et al., 2002Maia, da Silva, et al., 2002Maia, Zoghbi, et al., 2002Morteza-Semnani, Saeedi, et al., 2002
Comment MSDC-RI MSDC-RI MSDC-RI MSDC-RI MSDC-RI
Column type CapillaryCapillaryCapillaryCapillaryCapillary
Active phase DB-1HP-1DB-1HP-5DB-5MS
Column length (m) 30.50.50.30.30.
Carrier gas HeN2N2H2He
Substrate
Column diameter (mm) 0.250.250.250.250.25
Phase thickness (μm) 0.250.250.250.250.25
Tstart (C) 60.90.60.40.60.
Tend (C) 250.220.240.280.270.
Heat rate (K/min) 4.3.3.4.3.
Initial hold (min) 10.
Final hold (min)
I 1548.1530.1511.1542.1543.
ReferenceNorouzi-Arasi, Yavari, et al., 2002Priestap, van Baren, et al., 2002Velasco-Negueruela, Pérez-Alonso, et al., 2002Velickovic, Randjelovic, et al., 2002Zoghbi, Andrade, et al., 2002
Comment MSDC-RI MSDC-RI MSDC-RI MSDC-RI MSDC-RI
Column type CapillaryCapillaryCapillaryCapillaryCapillary
Active phase DB-5DB-1RSL-200RTX-1DB-5MS
Column length (m) 30.60.30.30.30.
Carrier gas HeN2H2N2He
Substrate
Column diameter (mm) 0.250.2480.320.250.25
Phase thickness (μm) 0.250.250.250.250.25
Tstart (C) 60.60.40.60.60.
Tend (C) 240.220.280.300.240.
Heat rate (K/min) 3.3.6.4.3.
Initial hold (min)  5.5.
Final hold (min)  22.5. 30.
I 1543.1535.1531.1533.1524.
ReferenceZoghbi, Andrade, et al., 2002, 2Bailac, Dellacasa, et al., 2001Jirovetz L., Buchbauer G., et al., 2001Kalemba, Marschall, et al., 2001Marongiu, Porcedda, et al., 2001
Comment MSDC-RI MSDC-RI MSDC-RI MSDC-RI MSDC-RI
Column type CapillaryCapillaryCapillaryCapillaryCapillary
Active phase PTE-5HP-5DB-5OV-101HP-1
Column length (m) 60.30.30.25.25.
Carrier gas H2H2HeN2H2
Substrate
Column diameter (mm) 0.320.250.250.250.32
Phase thickness (μm) 0.30.250.25 0.17
Tstart (C) 60.40.60.50.40.
Tend (C) 285.280.240.200.260.
Heat rate (K/min) 4.33.3.5.3.
Initial hold (min)  10.  5.
Final hold (min)  10.
I 1542.1540.1542.1536.1519.
ReferenceStojanovic, Palic, et al., 2001Bicalho, Pereira, et al., 2000Tellez, Dayan, et al., 2000Ayedoun, Adéoti, et al., 1999Lopes, Koketsu, et al., 1999
Comment MSDC-RI MSDC-RI MSDC-RI MSDC-RI MSDC-RI
Column type CapillaryCapillaryCapillaryCapillaryCapillary
Active phase CP Sil 5 CBDB-5DB-5DB-5CBP-1
Column length (m) 25.30.30.30.25.
Carrier gas HeHeHeliumHeHe
Substrate
Column diameter (mm) 0.250.250.250.250.22
Phase thickness (μm) 0.390.250.25
Tstart (C) 60.65.60.60.60.
Tend (C) 220.300.240.240.240.
Heat rate (K/min) 5.4.3.4.5.
Initial hold (min) 5.2.
Final hold (min) 20.
I 1532.1580.1542.1537.1536.
ReferenceRustaiyan, Masoudi, et al., 1999Elias, Simoneit, et al., 1997Tellez, Estell, et al., 1997Zunino, Novillo-Newton, et al., 1997Zygadlo, Ariza-Espinar, et al., 1997
Comment MSDC-RI MSDC-RI MSDC-RI MSDC-RI MSDC-RI
Column type Capillary
Active phase CP Sil 5 CB
Column length (m) 25.
Carrier gas
Substrate
Column diameter (mm) 0.25
Phase thickness (μm)
Tstart (C) 60.
Tend (C) 280.
Heat rate (K/min) 5.
Initial hold (min)
Final hold (min)
I 1534.
ReferenceKaul, Singh, et al., 1993
Comment MSDC-RI

Van Den Dool and Kratz RI, non-polar column, temperature ramp

Data compiled by: NIST Mass Spectrometry Data Center, William E. Wallace, director

Column type CapillaryCapillaryCapillaryCapillaryCapillary
Active phase HP-5DB-5RTX-1RTX-1SPB-1
Column length (m) 25.30.60.60.30.
Carrier gas He HeHeHe
Substrate
Column diameter (mm) 0.250.220.220.220.25
Phase thickness (μm) 0.250.250.250.250.25
Tstart (C) 60.60.60.60.50.
Tend (C) 240.240.230.230.250.
Heat rate (K/min) 4.3.2.2.5.
Initial hold (min) 2.2.  3.
Final hold (min)   35.35.15.
I 1549.1541.1539.1529.1517.
ReferenceDehghan, Solaimanian, et al., 2007Martins, Santos, et al., 2007Paolini J., Costa J., et al., 2007Paolini, Muselli, et al., 2007Radulovic, Lazarevic, et al., 2007
Comment MSDC-RI MSDC-RI MSDC-RI MSDC-RI MSDC-RI
Column type CapillaryCapillaryCapillaryCapillaryCapillary
Active phase HP-5MSHP-5MSZB-5DB-5HP-5MS
Column length (m) 30.30.30.30.30.
Carrier gas HeHeHeHeHe
Substrate
Column diameter (mm) 0.250.250.250.250.25
Phase thickness (μm) 0.250.250.250.250.25
Tstart (C) 60.60.50.60.60.
Tend (C) 280.280.250.240.280.
Heat rate (K/min) 4.4.3.3.3.
Initial hold (min) 5.5.
Final hold (min)
I 1540.1540.1543.1542.1542.
ReferenceRadulovic, Lazarevic, et al., 2007Saroglou, Marin, et al., 2007Simoniatto, Bonani, et al., 2007Telascrea, de Araujo, et al., 2007Vagionas, Ngassapa, et al., 2007
Comment MSDC-RI MSDC-RI MSDC-RI MSDC-RI MSDC-RI
Column type CapillaryCapillaryCapillaryCapillaryCapillary
Active phase BP-1BP-1HP-5DB-1HP-5MS
Column length (m) 50.50.30.30.30.
Carrier gas HeHeHeN2He
Substrate
Column diameter (mm) 0.220.220.250.250.25
Phase thickness (μm) 0.250.250.250.250.25
Tstart (C) 60.60.60.50.60.
Tend (C) 220.220.260.220.280.
Heat rate (K/min) 2.2.3.4.3.
Initial hold (min)
Final hold (min) 20.20.
I 1531.1526.1544.1531.1513.
ReferenceDuquesnoy, Dinh, et al., 2006Gonny, Cavaleiro, et al., 2006Javidnia K., Miri R., et al., 2006Kuiate, Bessière, et al., 2006Pavlovic, Kovacevic, et al., 2006
Comment MSDC-RI MSDC-RI MSDC-RI MSDC-RI MSDC-RI
Column type CapillaryCapillaryCapillaryCapillaryCapillary
Active phase DB-5HP-5MSDB-5DB-5RTX-1
Column length (m) 30.30.30.30.60.
Carrier gas HeHeHeHe
Substrate
Column diameter (mm) 0.320.250.250.250.22
Phase thickness (μm) 0.250.250.250.250.25
Tstart (C) 60.60.50.50.60.
Tend (C) 280.280.250.250.220.
Heat rate (K/min) 3.4.5.5.2.
Initial hold (min)  5.2.2.
Final hold (min)     20.
I 1531.1533.1546.1546.1530.
ReferencePavlovic, Tzakou, et al., 2006Saroglou, Dorizas, et al., 2006Su, Ho, et al., 2006Su, Ho, et al., 2006, 2Cozzani, Muselli, et al., 2005
Comment MSDC-RI MSDC-RI MSDC-RI MSDC-RI MSDC-RI
Column type CapillaryCapillaryCapillaryCapillaryCapillary
Active phase HP-5HP-5RTX-1HP-5MSHP-5MS
Column length (m) 30.30.60.30.30.
Carrier gas HeHeHeHeHe
Substrate
Column diameter (mm) 0.250.250.220.250.25
Phase thickness (μm) 0.250.250.250.250.25
Tstart (C) 60.60.60.60.60.
Tend (C) 260.260.230.250.280.
Heat rate (K/min) 3.3.2.4.3.
Initial hold (min)    2.
Final hold (min)   35.20.
I 1547.1545.1539.1542.1540.
ReferenceJavidnia, Miri, et al., 2005Javidnia, Miri, et al., 2005, 2Paolini, Costa, et al., 2005Pino, Mesa, et al., 2005Aligiannis, Kalpoutzakis, et al., 2004
Comment MSDC-RI MSDC-RI MSDC-RI MSDC-RI MSDC-RI
Column type CapillaryCapillaryCapillaryCapillaryCapillary
Active phase HP-5HP-5MSHP-5HP-5CP Sil 5 CB
Column length (m) 30.30.30.30.30.
Carrier gas HeHeHeHeN2
Substrate
Column diameter (mm) 0.250.250.250.250.25
Phase thickness (μm) 0.250.250.25 0.25
Tstart (C) 50.60.60.60.50.
Tend (C) 290.280.260.260.200.
Heat rate (K/min) 4.4.3.3.5.
Initial hold (min)  5.
Final hold (min)
I 1544.1540.1542.1541.1552.
ReferenceFlach A., Dondon R.C., et al., 2004Grujic-Jovanovic, Skaltsa, et al., 2004Javidnia, Miri, et al., 2004Javidnia, Miri, et al., 2004, 2Martinez, Rosa, et al., 2004
Comment MSDC-RI MSDC-RI MSDC-RI MSDC-RI MSDC-RI
Column type CapillaryCapillaryCapillaryCapillaryCapillary
Active phase SPB-5DB-5Optima 5OV-1HP-5
Column length (m) 30.30.25.25.30.
Carrier gas HeHeHeH2He
Substrate
Column diameter (mm) 0.250.250.250.250.25
Phase thickness (μm) 0.250.250.250.30.25
Tstart (C) 60.50.60.50.60.
Tend (C) 250.290.280.200.280.
Heat rate (K/min) 4.4.3.3.3.
Initial hold (min) 2.  1.
Final hold (min) 20. 20.20.
I 1540.1545.1529.1517.1542.
ReferencePino, Marbot, et al., 2004Reis, Pansarim, et al., 2004Vérité, Nacer, et al., 2004Bicchi, Rubiolo, et al., 2003Bougatsos, Meyer, et al., 2003
Comment MSDC-RI MSDC-RI MSDC-RI MSDC-RI MSDC-RI
Column type CapillaryCapillaryCapillaryCapillaryCapillary
Active phase RTX-1HP-5MSHP-5HP-5HP-5MS
Column length (m) 60.30.30.30.30.
Carrier gas HeHeHeHe
Substrate
Column diameter (mm) 0.220.250.250.250.25
Phase thickness (μm) 0.250.250.250.250.25
Tstart (C) 60.50.60.60.50.
Tend (C) 230.250.280.280.280.
Heat rate (K/min) 2.3.4.3.3.
Initial hold (min)   5. 5.
Final hold (min) 45.
I 1528.1542.1540.1546.1542.
ReferenceCavalli, Tomi, et al., 2003Salido, Altarejos, et al., 2003Skaltsa, Demetzos, et al., 2003Tsiri, Kretsi, et al., 2003Demetzos, Angelopoulou, et al., 2002
Comment MSDC-RI MSDC-RI MSDC-RI MSDC-RI MSDC-RI
Column type CapillaryCapillaryCapillaryCapillaryCapillary
Active phase DB-5CP Sil 5 CBCP Sil 5 CBHP-5HP-5
Column length (m) 30.30.50.30.30.
Carrier gas HeH2HeHeHe
Substrate
Column diameter (mm) 0.250.250.320.250.25
Phase thickness (μm) 0.250.250.40.250.25
Tstart (C) 60.60.60.60.60.
Tend (C) 260.280.280.280.280.
Heat rate (K/min) 4.2.3.3.3.
Initial hold (min)  10.10. 5.
Final hold (min)  40.60.
I 1542.1526.1530.1524.1542.
ReferenceJavidnia, Miri, et al., 2002Pino, Marbot, et al., 2002Pino, Marbot, et al., 2002, 2Pitarokili, Couladis, et al., 2002Aligiannis, Kalpoutzakis, et al., 2001
Comment MSDC-RI MSDC-RI MSDC-RI MSDC-RI MSDC-RI
Column type CapillaryCapillaryCapillaryCapillaryCapillary
Active phase HP-5RTX-5 MSDB-5CP Sil 5 CBHP-5MS
Column length (m) 30.30.30.50.30.
Carrier gas HeHeH2HeHe
Substrate
Column diameter (mm) 0.250.250.250.320.25
Phase thickness (μm) 0.250.250.250.40.25
Tstart (C) 60.70.60.60.60.
Tend (C) 260.210.240.280.280.
Heat rate (K/min) 3.4.3.3.4.
Initial hold (min)  10. 10.5.
Final hold (min) 10.10. 60.
I 1542.1548.1543.1531.1540.
ReferenceCouladis, Baziou, et al., 2001Hudaib, Grazia Bellardi, et al., 2001Nogueira, Bittrich, et al., 2001Pino, Marbot, et al., 2001Skaltsa, Mavrommati, et al., 2001
Comment MSDC-RI MSDC-RI MSDC-RI MSDC-RI MSDC-RI
Column type CapillaryCapillaryCapillary
Active phase CP Sil 5 CBOV-1DB-5
Column length (m) 25.25.30.
Carrier gas HeH2He
Substrate
Column diameter (mm) 0.250.250.26
Phase thickness (μm)  0.30.25
Tstart (C) 60.50.50.
Tend (C) 260.200.225.
Heat rate (K/min) 5.3.2.
Initial hold (min)  1.
Final hold (min)  20.20.
I 1538.1516.1540.
ReferenceWeyerstahl, Marschall, et al., 1999Bicchi, Fresia, et al., 1997Sagrero-Nieves, Bartley, et al., 1997
Comment MSDC-RI MSDC-RI MSDC-RI

Kovats' RI, non-polar column, temperature ramp

Data compiled by: NIST Mass Spectrometry Data Center, William E. Wallace, director

Column type CapillaryCapillaryCapillaryCapillaryCapillary
Active phase DB-1DB-5DB-5DB-5SPB-5
Column length (m) 25.30.30. 60.
Carrier gas HeHeHe He
Substrate
Column diameter (mm) 0.20.260.26 0.32
Phase thickness (μm)  0.250.25 1.
Tstart (C) 60.60.60.60.60.
Tend (C) 220.246.246.240.200.
Heat rate (K/min) 3.3.3.3.4.
Initial hold (min) 3.
Final hold (min)     30.
I 1538.1546.1542.1542.1560.
ReferenceMevy, Bessiere, et al., 2006Adams, Morris, et al., 2005Adams and Nguyen, 2005Shatar S., 2005Gauvin, Lecomte, et al., 2004
Comment MSDC-RI MSDC-RI MSDC-RI MSDC-RI MSDC-RI
Column type CapillaryCapillaryCapillaryCapillaryCapillary
Active phase HP-5MSHP-5MSDB-5DB-5CP Sil 5 CB
Column length (m) 30.30.30.30.25.
Carrier gas HeHeHeHeHe
Substrate
Column diameter (mm) 0.250.250.250.250.25
Phase thickness (μm) 0.250.250.250.250.15
Tstart (C) 60.60.60.60.50.
Tend (C) 280.280. 240.230.
Heat rate (K/min) 3.3.3.3.3.
Initial hold (min)
Final hold (min)    30.
I 1522.1524.1543.1523.1534.
ReferenceCouladis, Chinou, et al., 2003Gkinis, Tzakou, et al., 2003Lucero, Estell, et al., 2003Marongiu, Piras, et al., 2003Ogunwande, Olawore, et al., 2003
Comment MSDC-RI MSDC-RI MSDC-RI MSDC-RI MSDC-RI
Column type CapillaryCapillaryCapillaryCapillaryCapillary
Active phase BP-1SPB-1HP-5MSBP-1PTE-5
Column length (m) 25.30.30.30.60.
Carrier gas N2HeHeN2H2
Substrate
Column diameter (mm) 0.320.320.250.320.32
Phase thickness (μm) 0.250.250.250.250.39
Tstart (C) 60.60.50.60.60.
Tend (C) 220.225.250.220.285.
Heat rate (K/min) 5.2.3.5.4.3
Initial hold (min)  2.
Final hold (min) 15.5. 13.
I 1532.1520.1542.1539.1546.
ReferenceRaina, Srivastava, et al., 2003Jayaprakasha, Rao, et al., 2002Salido, Altarejos, et al., 2002Shawl, Srivastava, et al., 2002Gudzic, Dordevic, et al., 2001
Comment MSDC-RI MSDC-RI MSDC-RI MSDC-RI MSDC-RI
Column type CapillaryCapillaryCapillaryCapillaryCapillary
Active phase HP-5DB-5DB-5HP-5MSDB-5
Column length (m) 30.30.30.30.30.
Carrier gas HeHe He
Substrate
Column diameter (mm) 0.250.260.320.32
Phase thickness (μm) 0.250.25 0.25
Tstart (C) 60.60.50.70.40.
Tend (C) 280.246.250.250.210.
Heat rate (K/min) 3.3.3.3.2.
Initial hold (min)   5.5.2.
Final hold (min)     120.
I 1540.1542.1550.1536.1537.
ReferenceTzakou and Couladis, 2001Adams, 2000Tzakou, Harvala, et al., 2000Siani, Ramos, et al., 1999Loayza, Abujder, et al., 1995
Comment MSDC-RI MSDC-RI MSDC-RI MSDC-RI MSDC-RI
Column type Capillary
Active phase DB-5
Column length (m) 30.
Carrier gas
Substrate
Column diameter (mm)
Phase thickness (μm)
Tstart (C) 40.
Tend (C) 210.
Heat rate (K/min) 2.
Initial hold (min) 2.
Final hold (min) 120.
I 1541.
ReferenceLoayza, Abujder, et al., 1995
Comment MSDC-RI

Kovats' RI, non-polar column, custom temperature program

Data compiled by: NIST Mass Spectrometry Data Center, William E. Wallace, director

Column type CapillaryCapillary
Active phase CP Sil 8 CBDB-5MS
Column length (m) 50.30.
Carrier gas HeHe
Substrate
Column diameter (mm) 0.320.25
Phase thickness (μm) 0.250.25
Program 60C(1min) => 3C/min => 70C => 15C/min => 170C(8min) => 5C/min => 250C60C(5min) => 2C/min => 140C= 5C/min => 250C(5min)
I 1546.1542.
ReferenceRadusiene, Judzentiene, et al., 2005Tuberoso, Kowalczyk, et al., 2005
Comment MSDC-RI MSDC-RI

Van Den Dool and Kratz RI, non-polar column, custom temperature program

Data compiled by: NIST Mass Spectrometry Data Center, William E. Wallace, director

Column type CapillaryCapillaryCapillaryCapillary
Active phase HP-5MSDB-5BPX-5SE-52
Column length (m) 30.30.30.30.
Carrier gas HeHe He
Substrate
Column diameter (mm) 0.250.250.250.32
Phase thickness (μm) 0.250.250.250.15
Program 60C (1 min) => 5 C/min => 210C => 10 C/min => 280C (15 min)40C(2min) => 4C/min => 220C => 20C/min => 280C35C(5min) => 3C/min => 210C => 40C/min => 240C (4min)45C => 1C/min => 100C => 5C/min => 250C(10min)
I 1546.51546.1560.1546.
ReferenceAndriamaharavo, 2014Andrade, Sampaio, et al., 2007Cardeal, da Silva, et al., 2006Sacchetti, Guerrini, et al., 2006
Comment MSDC-RI MSDC-RI MSDC-RI MSDC-RI

References

Feizbakhsh and Naeemy, 2011
Feizbakhsh, A.; Naeemy, A., Volatile constituents of essential oils of Eleocharis pauciflora (Light) Link and Eleocharis uniglumis (Link) J.A. Schultes growing wild in Iran, Bull. Chem. Soc. Ethiop., 2011, 25, 3, 461-464, https://doi.org/10.4314/bcse.v25i3.68606 . [all data]

Karimi, Farmani, et al., 2011
Karimi, H.; Farmani, A.; Nourizadeh, H., A performance comparison of modern statistical technique for molecular descriptor selection and retention prediction of essential oil from leaves, Amer. J. Sci. Res., 2011, 38, 36-40. [all data]

Tekaya-Karoui, Boughalleb, et al., 2011
Tekaya-Karoui, A.; Boughalleb, N.; Hammami, S.; Ben Jannet, H.; Mighri, Z., Chemical composition and antifungal activity of volatile components from woody terminal branches and roots of Tetraclinis articulate (Vahl.) Masters growing in Tunisia, Afr. J. Plant Sci., 2011, 5, 2, 115-122. [all data]

Ho, Wang, et al., 2010
Ho, C.-L.; Wang, E.I.-C.; Yu, H.-T.; Yu, H.-M.; Su, Y.-C., Composition amd antioxidant activities of essential oils of different tissues from Cryptomeria japonica D. Don, Quarterly J. Chin. Forestry, 2010, 32, 1, 63-76. [all data]

Monsef-Esfahani, Miri, et al., 2010
Monsef-Esfahani, H.R.; Miri, A.; Amini, M.; Amanzadeh, Y.; Hadjiakhoondi, A.; Hajiaghaee, R.; Ajani, Y., Seasonal variations in the chemical composition, antioxidant activity and total phenolic content of Teucrium persicum Boiss. essential oils, Res. J. Biol. Sci., 2010, 5, 7, 492-498, https://doi.org/10.3923/rjbsci.2010.492.498 . [all data]

Radulovic, Blagojevic, et al., 2010
Radulovic, N.; Blagojevic, P.; Palic, R., Comparative study of the leaf volatiles of Arctostaphylos uva-ursi (L.) Spreng. and Vaccinium vitis-idaea L. (Ericaceae), Molecules, 2010, 15, 9, 6168-6185, https://doi.org/10.3390/molecules15096168 . [all data]

Radulovic, Dordevic, et al., 2010
Radulovic, N.S.; Dordevic, N.D.; Palic, R.M., Volatiles of Pleurospermum austriacum (L.) Hoffm. (Apiaceae), J. Serbian Chem. Soc., 2010, 75, 12, 1-11, https://doi.org/10.2298/JSC100323127R . [all data]

Radulovic, Dordevic, et al., 2010, 2
Radulovic, N.; Dordevic, N.; Markovic, M.; Palic, R., Volatile constituents of Glechoma Hirsuta Waldst. Kit. and G. Hederacea L. (Lamiaceae), Bull. Chem. Soc. Ethiop., 2010, 24, 1, 67-76, https://doi.org/10.4314/bcse.v24i1.52962 . [all data]

Silva, Pott, et al., 2010
Silva, D.B.; Pott, A.; Oliveira, D.C.R., Analyses of the headspace volatile constituents of aerial parts (leaves and stems), flowers and fruits of Bidens gardneri Bak. and Bidens sulphurea (Cav.) Sch. Bip. using solid-phase microextraction, J. Essen. Oil Res., 2010, 22, 6, 560-563, https://doi.org/10.1080/10412905.2010.9700400 . [all data]

de Souza, Lopes, et al., 2010
de Souza, A.; Lopes, E.M.C.; da Silva, M.C.; Cordeiro, I.; Young, M.C.M.; Sobral, M.E.G.; Moreno, P.R.H., Chemical composition and acetylcholinesterase inhibitory activity of essential oils of Myrceugenia myrciolides (Cambess.) O. Berg and Eugenia riedelliana O. Berg, Myrtaceae, Braz. J. Pharmacognosy, 2010, 20, 2, 175-179. [all data]

Yang, Zhang, et al., 2010
Yang, X.; Zhang, H.; Zhang, Y.; Zhao, H.; Dong, A.; Xu, L.; Yang, L.; Ma, Y.; Wang, J., Analysis if the essential oils of pine cones of Pinus koraiensis Steb. et Zucc. and P. sylvestris L. from China, J. Essen. Oil Res., 2010, 22, 5, 446-448, https://doi.org/10.1080/10412905.2010.9700368 . [all data]

Ho, Wang, et al., 2009
Ho, C.-L.; Wang, E.I.-C.; Su, Y.-C., Essential oil compositions and bioactivities of the various parts of Cinnamomum camphora Sieb. var. linallolifera Fujuta, Journal title only in Chinese, 2009, 31, 2, 77-96. [all data]

Museli, Pau, et al., 2009
Museli, A.; Pau, M.; Desjobert, J.-M.; Foddai, M.; Usai, M.; Costa, J., Volatile constituents of Achllea ligustica All. by HS-SPME/GC/GC-MS. Comparison with essential oils obtained by hydrodistillation from Corsica and Sardinia, Chromatographia, 2009, 69, 5/6, 575-585, https://doi.org/10.1365/s10337-008-0939-1 . [all data]

Retta, Gattuso, et al., 2009
Retta, D.; Gattuso, M.; Gattuso, S.; Lira, P. Di Leo; van Baren, C.; Ferraro, G.; Bandoni A., Essential oil composition of Achyrocline flaccida (Weinm.) DC. (Asteraceae) from different locations of Argentina, Biochem. Systematics Ecol., 2009, 36, 12, 877-881, https://doi.org/10.1016/j.bse.2008.11.001 . [all data]

Scrivanti, Anton, et al., 2009
Scrivanti, L.R.; Anton, A.M.; Zygadlo, J.A., Essential oil conposition of Bothriochloa Kuntze (Poaceae) from South America and their chemotaxonomy, Biochem. Systematics Ecol., 2009, 37, 3, 206-213, https://doi.org/10.1016/j.bse.2009.03.009 . [all data]

Shafaghat and Sadeghi, 2009
Shafaghat, A.; Sadeghi, H., Composition and antibacterial activity of essentia; oils from leaf, stem and root of Chrysanthemum parthenium (L.) Bernh. from Iran, Electronic J. of Environ., Agriculture and Food Chem. (EJEAFChe), 2009, 8, 9, 766-771. [all data]

de Souza, Lopes, et al., 2009
de Souza, A.; Lopes, E.M.C.; da Silva, M.C.; Cordeiro, I.; Young, M.C.M.; Sobral, M.E.G.; Moreno, P.R.H., Chemical composition and acetylcholinesterase inhibitory activity of essential oils of Myrceugenia myrcioides (Chambess.) O. Berg and Eugenia riedeliana O. Berg, Myrtaceae, Braz. J. Pharmacognosy, 2009, 20, 2, 175-179. [all data]

Baziou, Couladis, et al., 2008
Baziou, P.; Couladis, M.; Petrakis, P.V.; Verykokidou, E.; Harvala, C., Composition and antioxidant activity of the essential oil of Hypericum perfoliatum from Greece, 2008, retrieved from http://www.amapseec.org/cmapseec.1/Papers/papp065.htm. [all data]

Djarri, Medjroubi, et al., 2008
Djarri, L.; Medjroubi, K.; Akkai, S.; Elomri, A.; Seguin, E.; Groult, M.-L.; Verite, P., Variability of two essential olis of Kundmannia sicula (L.) DC., a traditional Algerian medicinal plant, Molecules, 2008, 13, 4, 812-817, https://doi.org/10.3390/molecules13040812 . [all data]

Kowalski, 2008
Kowalski, R., Antimicrobial activity of essential oils and extracts of rosinweed (Silphoum trifoliatum and Silphium integrifolium) plants used by the American Indians, Flav. Fragr. J., 2008, 23, 6, 426-433, https://doi.org/10.1002/ffj.1901 . [all data]

Lago, Romoff, et al., 2008
Lago, J.H.G.; Romoff, P.; Favero, O.A.; Souza, F.O.; Soares, M.G.; Baraldi, P.T.; Correa, A.G., Chemical composition of male and female Baccharis trimera (Less.) DC. (Asteraceae) essential oils, Biochem. Systematics Ecol., 2008, 36, 9, 737-740, https://doi.org/10.1016/j.bse.2008.05.009 . [all data]

Mierendorff, Stahl-Biskup, et al., 2008
Mierendorff, H.-G.; Stahl-Biskup, E.; Posthumus, M.A.; van Beek, T.A., Composition of commercial Cape chamomile oil (Eriocephalus punctuatus / Eriocephalus tenuifolius), 2008, retrieved from http://www.chemische-analysen-hamburg.de/Publikationen?CapeChamomileOil/. [all data]

Noudogbessi, Yedomonhan, et al., 2008
Noudogbessi, J.-P.; Yedomonhan, P.; Sohounhloue, D.C.K.; Chalchat, J.-C.; Figueredo, G., Chemical composition of essential oil of syzygium guineense (Willd.) DC. var. guineense (Myrtaceae) from Benin, Rec. Nat. Prod., 2008, 33-38. [all data]

Paolini, Tomi, et al., 2008
Paolini, J.; Tomi, P.; Bernardini, A.-F.; Bradesi, P.; Casanova, J.; Kaloustian, J., Detailed analysis of the essential oil from Cistus albidus L. by combination of GC/RI, GC/MS and 13C-NMR spectroscopy, N.Z. J. Agric. Res., 2008, 22, 14, 1270-1278. [all data]

Risticevic, Carasek, et al., 2008
Risticevic, S.; Carasek, E.; Pawliszyn, J., Headspace solid-phase microextraction-gas chromatographic-time-of-flight mass spectrometric methodology for geographical origin verification of coffee, Anal. Chim. Acta, 2008, 617, 1-2, 72-84, https://doi.org/10.1016/j.aca.2008.04.009 . [all data]

Sarikurkcu, Tepe, et al., 2008
Sarikurkcu, C.; Tepe, B.; Daferera, D.; Polissiou, M.; Harmandar, M., Studies on the anioxidant activity of the essential oil and methanol extract of Marrubium globosum subsp. globosum (lamiaceae) by three different chemical assays, Bioresource Technol., 2008, 99, 10, 4239-4246, https://doi.org/10.1016/j.biortech.2007.08.058 . [all data]

Yassa and Akhani, 2008
Yassa, N.; Akhani, H., The essential oils composition in two species of the genus Eriocycla Lindl. (Apiaceae) from Iran, 2008, retrieved from http://biology.ut.ac.ir/members/akhani/PdfReprintNumber/27.pdf. [all data]

Bos, Woerdenbag, et al., 2007
Bos, R.; Woerdenbag, H.J.; Kayser, O.; Quax, W.J.; Ruslan, K.; Elfami, Essential oil constituents of Piper cubeba L. fils. from Indonesia, J. Essent. Oil Res., 2007, 19, 1, 14-17, https://doi.org/10.1080/10412905.2007.9699217 . [all data]

Cheraif, Ben Jannet, et al., 2007
Cheraif, I.; Ben Jannet, H.; Hammami, M.; Khouja, M.L.; Mighri, Z., Chemical composition and antimicrobial activity of essential oils of Cupressus arizonica Greene, Biochem. Syst. Ecol., 2007, 35, 12, 813-820, https://doi.org/10.1016/j.bse.2007.05.009 . [all data]

Elfami, Bos, et al., 2007
Elfami; Bos, R.; Ruslan, K.; Woerdenbag, H.J.; Kayser, P.; Quax, W.J., Essential Oil Constituents of Piper cubeba from Indonesia, 2007, 53-60. [all data]

Farsam, Amanlou, et al., 2007
Farsam, H.; Amanlou, M.; Taghi-Cheetsaz, N.; Amin, G.R.; Saledi-Sormaghi, M.H., Essential Oil of Chimonanthus fragrans flowers Population of Tehran, DARU, 2007, 15, 3, 129-131. [all data]

Ferhat, Tigrine-Kordjani, et al., 2007
Ferhat, M.A.; Tigrine-Kordjani, N.; Chemat, S.; Meklati, B.Y.; Chemat, F., Rapid Extraction of Volatile Compounds Using a New Simultaneous Microwave Distillation: Solvent Extraction Device, Chromatographia, 2007, 65, 3-4, 217-222, https://doi.org/10.1365/s10337-006-0130-5 . [all data]

Hachicha, Skanji, et al., 2007
Hachicha, S.F.; Skanji, T.; Barrek, S.; Ghrabi, Z.G.; Zarrouk, H., Composition of the essential oil of Teucrium ramosissimum Desf. (Lamiaceae) from Tunisia, Flavour Fragr. J., 2007, 22, 2, 101-104, https://doi.org/10.1002/ffj.1764 . [all data]

Pala-Paul, Brophy, et al., 2007
Pala-Paul, J.; Brophy, J.J.; Perez-Alonso, M.J.; Usano, J.; Soria, S.C., Essential oil composition of the different parts of Eryngium corniculatum Lam. (Apiaceae) from Spain, J. Chromatogr. A, 2007, 1175, 2, 289-293, https://doi.org/10.1016/j.chroma.2007.10.061 . [all data]

Vagionas, Graikou, et al., 2007
Vagionas, K.; Graikou, K.; Ngassapa, O.; Runyoro, D.; Chinou, I., Composition and antimicrobial activity of the essential oils of three Satureja species growing in Tansania, Food Chem., 2007, 103, 2, 319-324, https://doi.org/10.1016/j.foodchem.2006.07.051 . [all data]

Vichi, Riu-Aumatell, et al., 2007
Vichi, S.; Riu-Aumatell, M.; Mora-Pons, M.; Guadayol, J.M.; Buxaderas, S.; López-Tamames, E., Analytical, Nutritional and Clinical Methods. HS-SPME coupled to GC/MS for quality control of Juniperus communis L. berries used for gin aromatization, Food Chem., 2007, 105, 4, 1748-1754, https://doi.org/10.1016/j.foodchem.2007.03.026 . [all data]

Yassa and Akhani, 2007
Yassa, N.; Akhani, H., The essential oils composition in two species of the genus Eriocycla Lindl. (Apiaceae) from Iran, 2007, retrieved from http://biology.ut.ac.ir/members/akhani/PdfReprintNumber/27.pdf. [all data]

Apel, Sobral, et al., 2006
Apel, M.A.; Sobral, M.; Zuanazzi, J.A.S.; Henriques, A.T., Essential oil composition of four Plinia species (Myrtaceae), Flavour Fragr. J., 2006, 21, 3, 565-567, https://doi.org/10.1002/ffj.1638 . [all data]

Apel, Sobral, et al., 2006, 2
Apel, M.A.; Sobral, M.; Zuanazzi, J.A.S.; Henriques, A.T., Essential oil composition of Calycorectes australis and Calycorectes psidiiflorus (Myrtaceae), Flavour Fragr. J., 2006, 21, 4, 656-658, https://doi.org/10.1002/ffj.1640 . [all data]

Champagnat, Figueredo, et al., 2006
Champagnat, P.; Figueredo, G.; Chalchat, J.-C.; Bessiere, J.-M., Essential oil composition of Vetiveria nigritana from Mali, J. Essent. Oil Res., 2006, 18, 6, 647-649, https://doi.org/10.1080/10412905.2006.9699193 . [all data]

Chen, Sheu, et al., 2006
Chen, H.-C.; Sheu, M.-J.; Wu, C.-M., Characterization of Volatiles in Guava (Psidium guajava L. cv. Chung-Shan-Yueh-Pa) Fruit from Taiwan, J. Food Drug. Anal., 2006, 14, 4, 398-402. [all data]

Elfami, Komar, et al., 2006
Elfami, R.B.; Komar, R.; Woerdenbag, H.J.; Kayser, P.; Quax, W.J., Essential oil constituents of Piper cubeba from Indonesia, 2006, retrieved from http://dissertations.ub.rug.nl/FILES/facultiew/science/2006/elfahmi/05c5.pdf. [all data]

Figuérédo, Cabassu, et al., 2006
Figuérédo, G.; Cabassu, P.; Chalchat, J.-C.; Pasquier, B., Studies of Mediterranean oregano populations. VIII. Chemical composition of essential oils of oreganos of various origins, Flavour Fragr. J., 2006, 21, 1, 134-139, https://doi.org/10.1002/ffj.1543 . [all data]

Filippi, Lanfranchi, et al., 2006
Filippi, J.-J.; Lanfranchi, D.-A.; Prado, S.; Baldovini, N.; Meierhenrich, U.J., Composition, Enantiomeric Distribution, and Antibacterial Activity of the Essential Oil of Achillea ligustica All. from Corsica, J. Agric. Food Chem., 2006, 54, 17, 6308-6313, https://doi.org/10.1021/jf060752y . [all data]

Gohari, Hadjiakhoondi, et al., 2006
Gohari, A.R.; Hadjiakhoondi, A.; Sadat-Ebrahimi, E.; Saeidnia, S.; Shafiee, A., Composition of the volatile oils of Satureja spicigera C. Koch Boiss. and S. macrantha C. A. Mey from Iran, Flavour Fragr. J., 2006, 21, 2, 348-350, https://doi.org/10.1002/ffj.1642 . [all data]

Gohari A.R., Hadjiakhoondi A., et al., 2006
Gohari A.R.; Hadjiakhoondi A.; Sadat-Ebrahimi E.; Saeidnia S.; Shafiee A., Composition of the volatile oils of Satureja spicigera C. Koch Boiss. and S-macrantha C. A. Mey from Iran, Flavour Fragr. J., 2006, 21, 3, 510-512, https://doi.org/10.1002/ffj.1613 . [all data]

Javidnia, Miri, et al., 2006
Javidnia, K.; Miri, R.; Kamalinejad, M.; Mehdipour, A.R., Composition of the essential oil of Diplotaenia cachrydifolia Boiss. from Iran, J. Ess. Oil Res., 2006, 18, 1, 86-87, https://doi.org/10.1080/10412905.2006.9699393 . [all data]

Kucuk, Gulec, et al., 2006
Kucuk, M.; Gulec, C.; Yasar, A.; Ucuncu, O.; Yayh, N.; Coskuncelebi, K.; Terzioglu, S.; Yayh, N., Chemical composition and antimicrobial activities of the essential oils of Teucrium chamaedrys subsp. chamaedrys, T. orientale var. puberulens, and T. chamaedrys subsp. lydium, Pharm. Biol., 2006, 44, 8, 592-599, https://doi.org/10.1080/13880200600896868 . [all data]

Lesueur, Ban, et al., 2006
Lesueur, D.; Ban, N.K.; Bighelli, A.; Muselli, A.; Casanova, J., Analysis of the root oil of Fokienia hodginsii (Dunn) Henry et Thomas (Cupressaceae) by GC, GC-MS and 13C-NMR, Flavour Fragr. J., 2006, 21, 1, 171-174, https://doi.org/10.1002/ffj.1557 . [all data]

Morteza-Semnani K., Saeedi M., et al., 2006
Morteza-Semnani K.; Saeedi M.; Changizi S., The essential oil composition of Hypericum scabrum L. from Iran, Flavour Fragr. J., 2006, 21, 3, 513-515, https://doi.org/10.1002/ffj.1614 . [all data]

Pala-Paul J., Perez-Alonso M.J., et al., 2006
Pala-Paul J.; Perez-Alonso M.J.; Velasco-Negueruela A.; Ballesteros M.T.; Sanz J., Essential oil composition of Sideritis hirsuta L. from Guadalajara Province, Spain, Flavour Fragr. J., 2006, 21, 3, 410-415, https://doi.org/10.1002/ffj.1727 . [all data]

Pino, Marquez, et al., 2006
Pino, J.A.; Marquez, E.; Marbot, R., Volatile constituents from tea of roselle (Hibiscus sabdariffa L.), Rev. CENIC Ciencias Quimicas, 2006, 37, 3, 127-129. [all data]

Pino, Marbot, et al., 2006
Pino, J.A.; Marbot, R.; Payo, A.; Chao, D.; Herrera, P., Aromatic Plants from Western Cuba VII. Composition of the Leaf Oil of Psidium wrightii KRug et Urb., Lantana involucrata L., Cinnamonum montanum (Sw.) Berchtold et J. Persl. and Caesalpinia violacea (Mill.) Standley, J. Essent. Oil. Res., 2006, 18, 2, 170-174, https://doi.org/10.1080/10412905.2006.9699058 . [all data]

Pitarokili, Tzakou, et al., 2006
Pitarokili, D.; Tzakou, O.; Loukis, A., Essential oil composition of Salvia verticillata, S. verbenaca, S. glutinosa and S. candidissima growing wild in Greece, Flavour Fragr. J., 2006, 21, 4, 670-673, https://doi.org/10.1002/ffj.1647 . [all data]

Asadipour, Mehrabani, et al., 2005
Asadipour, A.; Mehrabani, M.; Najafi, M.L., Volatile oil composition of Centaurea aucheri (DC.) wagenitz, DARU, 2005, 13, 3, 160-164. [all data]

Chaverri and Cicció, 2005
Chaverri, C.; Cicció, J.F., Essential oil of trees of the genus Ocotea (Lauraceae) in Costa Rica. I. Ocotea brenesii, Rev. Biol. Trop., 2005, 53, 3-4, 431-436, https://doi.org/10.15517/rbt.v53i3-4.14611 . [all data]

Ferraz, Limberger, et al., 2005
Ferraz, A.B.F.; Limberger, R.P.; Bordignon, S.A.L.; von Poser, G.L.; Henriques, A.T., Essential oil composition of six Hypericum species from southern Brazil, Flavour Fragr. J., 2005, 20, 3, 335-339, https://doi.org/10.1002/ffj.1435 . [all data]

Fernandez, Lizzani-Cuvelier, et al., 2005
Fernandez, X.; Lizzani-Cuvelier, L.; Loiseau, A.-M.; Perichet, C.; Delbecque, C.; Arnaudo, J.-F., Chemical composition of the essential oils from Turkish and Honduras Styrax, Flavour Fragr. J., 2005, 20, 1, 70-73, https://doi.org/10.1002/ffj.1370 . [all data]

Ferretti, Maggi, et al., 2005
Ferretti, G.; Maggi, F.; Tirillini, B., Essential oil composition of Hypericum richeri Vill. from Italy, Flavour Fragr. J., 2005, 20, 3, 295-298, https://doi.org/10.1002/ffj.1412 . [all data]

Gauvin and Smadja, 2005
Gauvin, A.; Smadja, J., Essential oil composition of four Psiadia species from Reunion Island: A chemotaxonomic study, Biochem. Syst. Ecol., 2005, 33, 7, 705-714, https://doi.org/10.1016/j.bse.2004.12.013 . [all data]

Kowalski and Wolski, 2005
Kowalski, R.; Wolski, T., The chemical composition of essential oils of Silphium perfoliatum L., Flavour Fragr. J., 2005, 20, 3, 306-310, https://doi.org/10.1002/ffj.1418 . [all data]

Marongiu, Piras, et al., 2005
Marongiu, B.; Piras, A.; Porcedda, S.; Scorciapino, A., Chemical composition of the essential oil and supercritical CO2 extract of Commiphora myrrha (Nees) Engl. and of Acorus calamus L., J. Agric. Food Chem., 2005, 53, 20, 7939-7943, https://doi.org/10.1021/jf051100x . [all data]

Morteza-Semnani, Akbarzadeh, et al., 2005
Morteza-Semnani, K.; Akbarzadeh, M.; Rostami, B., The essential oil composition of Teucrium chamaedrys L. from Iran, Flavour Fragr. J., 2005, 20, 5, 544-546, https://doi.org/10.1002/ffj.1479 . [all data]

Morteza-Semnani and Saeedi, 2005
Morteza-Semnani, K.; Saeedi, M., The essential oil composition of Phlomis bruguieri Desf. from Iran, Flavour Fragr. J., 2005, 20, 3, 344-346, https://doi.org/10.1002/ffj.1459 . [all data]

Pala-Paul, Perez-Alonso, et al., 2005
Pala-Paul, J.; Perez-Alonso, M.J.; Velasco-Negueruela, A.; Vadare, J.; Villa, A.M.; Sanz, J.; Brophy, J.J., Essential oil composition of the different parts of Eryngium bourgatii Gouan from Spain, J. Chromatogr. A, 2005, 1074, 1-2, 235-239, https://doi.org/10.1016/j.chroma.2005.03.036 . [all data]

Sajjadi and Ghannadi, 2005
Sajjadi, S.-E.; Ghannadi, A., Essential oil of the Persian sage, Salvia rhytidea Benth., Acta Pharm. Sin., 2005, 55, 321-326. [all data]

Senatore, Apostolides Arnold, et al., 2005
Senatore, F.; Apostolides Arnold, N.; Bruno, M., Volatile components of Centaurea eryngioides Lam. and Centaurea liberica Trev. var. hermonis Boiss. Lam., two Asteraceae growing wild in Lebanon, Nat. Prod. Res., 2005, 19, 8, 749-754, https://doi.org/10.1080/14786410412331302136 . [all data]

Vichi, Riu-Aumatell, et al., 2005
Vichi, S.; Riu-Aumatell, M.; Mora-Pons, M.; Buxaderas, S.; Lopez-Tamames, E., Characterization of Volatiles in Different Dry Gins, J. Agric. Food Chem., 2005, 53, 26, 10154-10160, https://doi.org/10.1021/jf058121b . [all data]

Yayli, Yasar, et al., 2005
Yayli, N.; Yasar, A.; Gülec, C.; Usta, A.; Kolayli, S.; Coskuncelebi, K.; Karaoglu, S., Composition and antimicrobial activity of essential oils from Centaurea sessilis and Centaurea armena, Phytochemistry, 2005, 66, 14, 1741-1745, https://doi.org/10.1016/j.phytochem.2005.04.006 . [all data]

Abreu, Reis, et al., 2004
Abreu, I.N.; Reis, M.G.; Marsaioli, A.J.; Mazzafera, P., Essential oil composition of Hypericum brasiliense choise, Flavour Fragr. J., 2004, 19, 1, 80-82, https://doi.org/10.1002/ffj.1319 . [all data]

Blanc, Muselli, et al., 2004
Blanc, M.-C.; Muselli, A.; Bradesi, P.; Casanova, J., Chemical composition and variability of the essential oil of Inula graveolens from Corsica, Flavour Fragr. J., 2004, 19, 4, 314-319, https://doi.org/10.1002/ffj.1304 . [all data]

Fekam Boyom, Fotio, et al., 2004
Fekam Boyom, F.; Fotio, D.; Amvam Zollo, P.H.; Agnaniet, H.; Menut, C.; Bessière, J.M., Aromatic plants of tropical Central Africa. Part XLIV. Volatile components from Pseudocedrela kotschyi (Schweinf.) harms growing in Cameroon, Flavour Fragr. J., 2004, 19, 1, 9-11, https://doi.org/10.1002/ffj.1254 . [all data]

Limberger, Sobral, et al., 2004
Limberger, R.P.; Sobral, M.; Henriques, A.T.; Menut, C.; Bessière, J.-M., Óleos voláteis de espécies de Myrcia nativas do rio grande do sul, Quim. Nova, 2004, 27, 6, 916-919, https://doi.org/10.1590/S0100-40422004000600015 . [all data]

Lis, Boczek, et al., 2004
Lis, A.; Boczek, E.; Góra, J., Chemical composition of the essential oils from fruits, leaves and flowers of the Amur cork tree (Phellodendron amurense Rupr.), Flavour Fragr. J., 2004, 19, 6, 549-553, https://doi.org/10.1002/ffj.1349 . [all data]

Miyazawa, Fuhita, et al., 2004
Miyazawa, M.; Fuhita, T.; Yamafuji, C.; Matsui, M.; Kasahara, N.; Takagi, Y.; Ishikawa, Y., Chemical composition of volatile oil from the roots of Periploca sepium, J. Oleo Sci., 2004, 53, 10, 511-513, https://doi.org/10.5650/jos.53.511 . [all data]

Miyazawa, Fujita, et al., 2004
Miyazawa, M.; Fujita, T.; Yamafuji, C.; Matsui, M.; Kasahara, N.; Takagi, Y.; Ishikawa, Y., Chemical composition of volatile oil from the roots of Periploca sepium, J. Oleo Sci., 2004, 53, 11, 511-513, https://doi.org/10.5650/jos.53.511 . [all data]

Palá-Paúl, Brophy, et al., 2004
Palá-Paúl, J.; Brophy, J.J.; Goldsack, R.J.; Fontaniella, B., Analysis of the volatile components of Lavandula canariensis (L.) Mill., a Canary Islands endemic species, growing in Australia, Biochem. Syst. Ecol., 2004, 32, 1, 55-62, https://doi.org/10.1016/S0305-1978(03)00177-7 . [all data]

Simic, Sokovic, et al., 2004
Simic, A.; Sokovic, M.D.; Ristic, M.; Grujic-Jovanovic, S.; Vukojevic, J.; Marin, P.D., The chemical composition of some Lauraceae essential oils and their antifungal activities, Phytother. Res., 2004, 18, 9, 713-717, https://doi.org/10.1002/ptr.1516 . [all data]

Woerdenbag, Windono, et al., 2004
Woerdenbag, H.J.; Windono, T.; Bos, R.; Riswan, S.; Quax, W.J., Composition of the essential oils of Kaempferia rotunda L. and Kaempferia angustifolia Roscoe rhizomes from Indonesia, Flavour Fragr. J., 2004, 19, 2, 145-148, https://doi.org/10.1002/ffj.1284 . [all data]

Ghasemi, Asghari, et al., 2003
Ghasemi, N.; Asghari, G.; Ardakani, M.S.; Siahpoush, A., Characterization of volatile constituents from aerial parts of varthemia persica DC (var. persica), Iran. J. Pharm. Res., 2003, 2, 241-243. [all data]

Ghassemi, Sajjadi, et al., 2003
Ghassemi, N.; Sajjadi, S.E.; Ghannadi, A.; Shams-Ardakani, M.; Mehrabani, M., Volatile constituents of a medicinal plant of Iran, Echium Amoenum Fisch. and C.A. Mey, 2003, retrieved from http://www1.tums.ac.ir/daru/Daru1202003/Mehrabani.pdf. [all data]

Limberger, Simões-Pires, et al., 2003
Limberger, R.P.; Simões-Pires, C.A.; Sobral, M.; Menut, C.; Bessiere, J.-M.; Henriques, A.T., Essential oils of six Gomidesia spp. from southern Brazil, Flavour Fragr. J., 2003, 18, 2, 144-147, https://doi.org/10.1002/ffj.1122 . [all data]

Maia, Taveira, et al., 2003
Maia, J.G.S.; Taveira, F.S.N.; Andrade, E.H.A.; da Silva, M.H.L.; Zoghbi, M.G.B., Essential oils of Lippia grandis Schau., Flavour Fragr. J., 2003, 18, 5, 417-420, https://doi.org/10.1002/ffj.1241 . [all data]

Marongiu, Porcedda, et al., 2003
Marongiu, B.; Porcedda, S.; Caredda, A.; de Gioannis, B.; Vargiu, L.; la Colla, P., Extraction of Juniperus oxycedrus ssp. Oxycedrus essential oil by supercritical carbon dioxide: influence of some process parameters and biological activity, Flavour Fragr. J., 2003, 18, 5, 390-397, https://doi.org/10.1002/ffj.1224 . [all data]

Mierendorff, Stahl-Biskup, et al., 2003
Mierendorff, H.-G.; Stahl-Biskup, E.; Posthumus, M.A.; van Beek, T.A., Composition of commercial Cape chamomile oil (Eriocephalus punctulatus), Flavour Fragr. J., 2003, 18, 6, 510-514, https://doi.org/10.1002/ffj.1259 . [all data]

Pino, Marbot, et al., 2003
Pino, J.A.; Marbot, R.; Fuentes, V., Characterization of volatiles in Bullock's heart (Annona reticulata L.) fruit cultivars from Cuba, J. Agric. Food Chem., 2003, 51, 13, 3836-3839, https://doi.org/10.1021/jf020733y . [all data]

Pitarokili, Tzakou, et al., 2003
Pitarokili, D.; Tzakou, O.; Loukis, A.; Harvala, C., Volatile metabolites from Salvia fruticosa as antifungal agents in soilborne pathogens, J. Agric. Food Chem., 2003, 51, 11, 3294-3301, https://doi.org/10.1021/jf0211534 . [all data]

Stashenko, Jaramillo, et al., 2003
Stashenko, E.E.; Jaramillo, B.E.; Martínez, J.R., Comparación de la composición química y de la actividad antioxidante in vitro de los metabolitos secundarios volátiles de plantas de la familia verbenaceae, Rev. Acad. Colomb. Cienc. Exactas Fis. Nat., 2003, 27, 105, 579-597. [all data]

Velickovic, Randjelovic, et al., 2003
Velickovic, D.T.; Randjelovic, N.V.; Ristic, M.S.; Velickovic, A.S.; Smelcerovic, A.A., Chemical constituents and antimicrobial activity of the ethanol extracts obtained from the flower, leaf, and stem of Salvia officinalis L., J. Serb. Chem. Soc., 2003, 68, 1, 17-24, https://doi.org/10.2298/JSC0301017V . [all data]

Velickovic, Ristic, et al., 2003
Velickovic, A.S.; Ristic, M.S.; Velickovic, D.T.; Ilic, S.; Mitic, N.D., The possibilities of the application of some species of sage (Salvia L.) as auxiliaries in the treatment of some diseases, J. Serb. Chem. Soc., 2003, 68, 6, 435-445, https://doi.org/10.2298/JSC0306435V . [all data]

Zoghbi, Andrade, et al., 2003
Zoghbi, M.G.B.; Andrade, E.H.A.; da Silva, M.H.; Carreira, L.M.M.; Maia, J.G.S., Essential oils from three Myrcia species, Flavour Fragr. J., 2003, 18, 5, 421-424, https://doi.org/10.1002/ffj.1242 . [all data]

Boyom, Keumedjio, et al., 2002
Boyom, F.F.; Keumedjio, F.; Dongmo, P.M.J.; Ngadjui, B.T.; Zollo, A.; Menut, C.; Bessiere, J.M., Essential oils from Croton zambesicus Muell. Arg. growing in Cameroon, Flavour Fragr. J., 2002, 17, 3, 215-217, https://doi.org/10.1002/ffj.1081 . [all data]

Caredda, Marongiu, et al., 2002
Caredda, A.; Marongiu, B.; Porcedda, S.; Soro, C., Supercritical carbon dioxide extraction and characterization of Laurus nobilis essential oil, J. Agric. Food Chem., 2002, 50, 6, 1492-1496, https://doi.org/10.1021/jf0108563 . [all data]

Cicció and Gómez-Laurito, 2002
Cicció, J.F.; Gómez-Laurito, J., Volatile constituents of the leaves of Siparuna thecaphora (Siparunaceae) from Turrialba, Costa Rica, Rev. Biol. Trop., 2002, 50, 3/4, 963-967. [all data]

Congiu, Falconieri, et al., 2002
Congiu, R.; Falconieri, D.; Marongiu, B.; Piras, A.; Porcedda, S., Extraction and isolation of Pistacia lentiscus L. essential oil by supercritical CO2, Flavour Fragr. J., 2002, 17, 4, 239-244, https://doi.org/10.1002/ffj.1095 . [all data]

Gudzic, Djokovic, et al., 2002
Gudzic, B.; Djokovic, D.; Vajs, V.; Palic, R.; Stojanovic, G., Composition and antimicrobial activity of the essential oil of Hypericum maculatum Crantz, Flavour Fragr. J., 2002, 17, 5, 392-394, https://doi.org/10.1002/ffj.1112 . [all data]

Kabouss, Charrouf, et al., 2002
Kabouss, A.E.; Charrouf, Z.; Faid, M.; Garneau, F.-X.; Collin, G., Chemical composition and antimicrobial activity of the leaf essential oil of Argania spinosa L. Skeels, J. Essent. Oil Res., 2002, 14, 2, 147-149, https://doi.org/10.1080/10412905.2002.9699801 . [all data]

Kobaisy, Tellez, et al., 2002
Kobaisy, M.; Tellez, M.R.; Dayan, F.E.; Duke, S.O., Phytotoxicity and volatile constituents from leaves of Callicarpa japonica Thunb., Phytochemistry, 2002, 61, 1, 37-40, https://doi.org/10.1016/S0031-9422(02)00207-8 . [all data]

Krauze-Baranowska, Mardarowicz, et al., 2002
Krauze-Baranowska, M.; Mardarowicz, M.; Wiwart, M.; Poblocka, L.; Dynowska, M., Antifungal activity of the essential oils from some species of the genus Pinus, Z. Naturforsch., 2002, 57c, 478-482. [all data]

Lockwood, Asghari, et al., 2002
Lockwood, G.B.; Asghari, G.; Hakimi, B., Production of essential oil constituents by cultured cells of Carum copticum L., Flavour Fragr. J., 2002, 17, 6, 456-458, https://doi.org/10.1002/ffj.1129 . [all data]

Mahmout, Bessière, et al., 2002
Mahmout, Y.; Bessière, J.-M.; Dolmazon, R., Constituents of the essential oil of Cyperus maculatus Boëck, J. Essent. Oil Res., 2002, 14, 4, 263-265, https://doi.org/10.1080/10412905.2002.9699848 . [all data]

Maia, da Silva, et al., 2002
Maia, J.G.S.; da Silva, M.H.L.; Andrade, E.H.A.; Zoghbi, M.G.B.; Carreira, L.M.M., Essential oils from Astronium urundeuva (Allemao) Engl. and A. fraxinifolium Schott ex Spreng., Flavour Fragr. J., 2002, 17, 1, 72-74, https://doi.org/10.1002/ffj.1046 . [all data]

Maia, Zoghbi, et al., 2002
Maia, J.G.S.; Zoghbi, M.G.B.; Andrade, E.H.A.; da Silva, M.H.L.; Luz, A.I.R.; da Silva, J.D., Essential oils composition of Eupatorium species growing wild in the Amazon, Biochem. Syst. Ecol., 2002, 30, 11, 1071-1077, https://doi.org/10.1016/S0305-1978(02)00059-5 . [all data]

Morteza-Semnani, Saeedi, et al., 2002
Morteza-Semnani, K.; Saeedi, M.; Vahedi, M., Volatile constituents of Iranian Hypericum perfloratum L., Oriental J. Chem., 2002, 18, 3, 443-444. [all data]

Norouzi-Arasi, Yavari, et al., 2002
Norouzi-Arasi, H.; Yavari, I.; Ghaffarzadeh, F.; Mortazavi, M.-S., Volatile constituents of Cymbopogon olivieri (Boiss.) Bor from Iran, Flavour Fragr. J., 2002, 17, 4, 272-274, https://doi.org/10.1002/ffj.1096 . [all data]

Priestap, van Baren, et al., 2002
Priestap, H.A.; van Baren, C.M.; Lira, P.D.L.; Prado, H.J.; Neugebauer, M.; Mayer, R.; Bandoni, A.L., Essential oils from aerial parts of Aristolochia gibertii Hook., Flavour Fragr. J., 2002, 17, 1, 69-71, https://doi.org/10.1002/ffj.1044 . [all data]

Velasco-Negueruela, Pérez-Alonso, et al., 2002
Velasco-Negueruela, A.; Pérez-Alonso, M.J.; Palá-Paúl, J.; Íñigo, A.; López, G., Leaf essential oils analysis of Juniperus navicularis Gandoger, Botanica Complutensis, 2002, 26, 85-91. [all data]

Velickovic, Randjelovic, et al., 2002
Velickovic, D.T.; Randjelovic, N.V.; Ristic, M.S.; Smelcerovic, A.A.; Velickovic, A.S., Chemical composition and antimicrobial action of the ethanol extracts of Salvia pratensis L., Salvia glutinosa L. and Salvia aethiopis L., J. Serb. Chem. Soc., 2002, 67, 10, 639-646, https://doi.org/10.2298/JSC0210639V . [all data]

Zoghbi, Andrade, et al., 2002
Zoghbi, M.G.B.; Andrade, E.H.A.; da Silva, M.H.L.; Maia, J.G.S., Volatile constituents of Lippia lupulina Cham., Flavour Fragr. J., 2002, 17, 1, 29-31, https://doi.org/10.1002/ffj.1032 . [all data]

Zoghbi, Andrade, et al., 2002, 2
Zoghbi, M.G.B.; Andrade, E.H.A.; da Silva, M.H.; Maia, J.G.S.; Luz, A.I.R.; da Silva, J.D., Chemical variation in the essential oils of Hyptis crenata Pohl ex Benth., Flavour Fragr. J., 2002, 17, 1, 5-8, https://doi.org/10.1002/ffj.1031 . [all data]

Bailac, Dellacasa, et al., 2001
Bailac, P.N.; Dellacasa, A.D.; Bernasconi, H.O.; Ponzi, M.I.; Firpo, N.H., Essential oil of female plants of Baccharis coridifolia De Candole, J. Essent. Oil Res., 2001, 13, 1, 23-24, https://doi.org/10.1080/10412905.2001.9699593 . [all data]

Jirovetz L., Buchbauer G., et al., 2001
Jirovetz L.; Buchbauer G.; Shafi P.M.; Rosamma M.K.; Geissler M., Analysis of the composition and aroma of the essential leaf oil of Syzygium travancoricum from South India by GC-FID, GC-MS, and olfactometry. Seasonal changes of composition, Chromatographia Sup., 2001, 53, S1, s372-s374, https://doi.org/10.1007/BF02490359 . [all data]

Kalemba, Marschall, et al., 2001
Kalemba, D.; Marschall, H.; Bradesi, P., Constituents of the essential oil of Solidago gigantea Ait. (giant goldenrod), Flavour Fragr. J., 2001, 16, 1, 19-26, https://doi.org/10.1002/1099-1026(200101/02)16:1<19::AID-FFJ940>3.0.CO;2-U . [all data]

Marongiu, Porcedda, et al., 2001
Marongiu, B.; Porcedda, S.; Porta, G.D.; Reverchon, E., Extraction and isolation of Salvia desoleana and Mentha spicata subsp. insularis essential oils by supercritical CO2, Flavour Fragr. J., 2001, 16, 5, 384-388, https://doi.org/10.1002/ffj.1021 . [all data]

Stojanovic, Palic, et al., 2001
Stojanovic, G.; Palic, R.; Naskovic, T.; Dokovic, D.; Milosavljevic, S., Volatile constituents of Achillea lingulata W.K., J. Essent. Oil Res., 2001, 13, 5, 378-379, https://doi.org/10.1080/10412905.2001.9712239 . [all data]

Bicalho, Pereira, et al., 2000
Bicalho, B.; Pereira, A.S.; Aquino Neto, F.R.; Pinto, A.C.; Rezende, C.M., Application of high-temperature gas chromatography-mass spectrometry to the investigation of glycosidically bound components related to cashew applie (Anacardium occidentale L. Var. nanum) volatiles, J. Agric. Food Chem., 2000, 48, 4, 1167-1174, https://doi.org/10.1021/jf9909252 . [all data]

Tellez, Dayan, et al., 2000
Tellez, M.R.; Dayan, F.E.; Schrader, K.K.; Wedge, D.E.; Duke, S.O., Composition and some biological activities of the essential oils of Callicarpa Americana (L.), J. Agric. Food Chem., 2000, 48, 7, 3008-3012, https://doi.org/10.1021/jf991026g . [all data]

Ayedoun, Adéoti, et al., 1999
Ayedoun, M.A.; Adéoti, B.S.; Setondji, J.; Tchoumbougnang, F.; Kuiaté, J.R.; Zollo, P.H.A.; Menut, C.; Lamaty, G.; Bessière, J.M., Aromatic plants of tropical West Africa. XII. Essential oil of Hoslundia opposita Vahl. growing in Benin and Cameroon, Flavour Fragr. J., 1999, 14, 5, 319-321, https://doi.org/10.1002/(SICI)1099-1026(199909/10)14:5<319::AID-FFJ836>3.0.CO;2-O . [all data]

Lopes, Koketsu, et al., 1999
Lopes, D.; Koketsu, M.; Carauta, J.P.P.; de Oliveira, R.R.; Kaplan, M.A.C., Chemical composition of Pourouma guianensis Aublet essential oils, Flavour Fragr. J., 1999, 14, 4, 233-236, https://doi.org/10.1002/(SICI)1099-1026(199907/08)14:4<233::AID-FFJ813>3.0.CO;2-L . [all data]

Rustaiyan, Masoudi, et al., 1999
Rustaiyan, A.; Masoudi, S.; Monfared, A.; Komeilizadeh, H., Volatile constituents of three Salvia species grown wild in Iran, Flavour Fragr. J., 1999, 14, 5, 276-278, https://doi.org/10.1002/(SICI)1099-1026(199909/10)14:5<276::AID-FFJ825>3.0.CO;2-Y . [all data]

Elias, Simoneit, et al., 1997
Elias, V.O.; Simoneit, B.R.T.; Cardoso, J.N., Analysis of volatile sesquiterpenoids in environmental and geological samples, J. Hi. Res. Chromatogr., 1997, 20, 6, 305-309, https://doi.org/10.1002/jhrc.1240200602 . [all data]

Tellez, Estell, et al., 1997
Tellez, M.R.; Estell, R.E.; Frederickson, E.L.; Havstad, K.M., Essntial oil of Flourensia cernua DC, J. Essent. Oil Res., 1997, 9, 6, 619-624, https://doi.org/10.1080/10412905.1997.9700799 . [all data]

Zunino, Novillo-Newton, et al., 1997
Zunino, M.P.; Novillo-Newton, M.; Maestri, D.M.; Zygadlo, J.A., Composition of the essential oil of Baccharis crispa Spreng. and Baccharis salicifolia Pers. grown in Cordoba (Argentina), Flavour Fragr. J., 1997, 12, 6, 405-407, https://doi.org/10.1002/(SICI)1099-1026(199711/12)12:6<405::AID-FFJ667>3.0.CO;2-R . [all data]

Zygadlo, Ariza-Espinar, et al., 1997
Zygadlo, J.A.; Ariza-Espinar, L.; Velasco-Negueruela, A.; Perez-Alonso, M.J., Volatile constituents of Stevia achalensis hieronymus, Flavour Fragr. J., 1997, 12, 4, 297-299, https://doi.org/10.1002/(SICI)1099-1026(199707)12:4<297::AID-FFJ625>3.0.CO;2-2 . [all data]

Kaul, Singh, et al., 1993
Kaul, V.K.; Singh, B.; Sood, R.P., Volatile Constituents of the Essential Oil of Tanacetum longifolium Wall., J. Essent. Oil Res., 1993, 5, 6, 597-601, https://doi.org/10.1080/10412905.1993.9698290 . [all data]