3-isopropylpyrocatechol

Gas phase thermochemistry data

Data compiled by: Hussein Y. Afeefy, Joel F. Liebman, and Stephen E. Stein

Quantity Value Units Method Reference Comment
Δfgas-350.0 ± 2.3kJ/molCcbRibeiro Da Silva and Ribeiro Da Silva, 1984

Condensed phase thermochemistry data

Data compiled by: Hussein Y. Afeefy, Joel F. Liebman, and Stephen E. Stein

Quantity Value Units Method Reference Comment
Δfsolid-447.8 ± 1.6kJ/molCcbRibeiro Da Silva and Ribeiro Da Silva, 1984
Quantity Value Units Method Reference Comment
Δcsolid-4808.8 ± 1.1kJ/molCcbRibeiro Da Silva and Ribeiro Da Silva, 1984Corresponding Δfsolid = -447.8 kJ/mol (simple calculation by NIST; no Washburn corrections)

References

Ribeiro Da Silva and Ribeiro Da Silva, 1984
Ribeiro Da Silva, M.D.M.C.; Ribeiro Da Silva, M.A.V., Enthalpies of combustion of 1,2-dihydroxybenzene and of six alkylsubstituted 1,2-dihydroxybenzenes, J. Chem. Thermodyn., 1984, 16, 1149-1155. [all data]