Tungsten, pentacarbonyl(phosphorus trichloride)-

Gas phase ion energetics data

Data compiled as indicated in comments:
LLK - Sharon G. Lias, Rhoda D. Levin, and Sherif A. Kafafi
RDSH - Henry M. Rosenstock, Keith Draxl, Bruce W. Steiner, and John T. Herron

Ionization energy determinations

IE (eV) Method Reference Comment
8.50 ± 0.05EIDistefano, Innorta, et al., 1968RDSH
8.39PEDaamen, Boxhoorn, et al., 1978Vertical value; LLK

References

Distefano, Innorta, et al., 1968
Distefano, G.; Innorta, G.; Pignataro, S.; Foffani, A., Correlation between the ionization potentials of transition metal complexes and of the corresponding ligands, J. Organometal. Chem., 1968, 14, 165. [all data]

Daamen, Boxhoorn, et al., 1978
Daamen, H.; Boxhoorn, G.; Oskam, A., U. V. photoelectron (He I and He II) studies of M(CO)5PX3 (M=Cr, Mo, W and X=F, Cl, Br), Inorg. Chim. Acta, 1978, 28, 263. [all data]