1H-Imidazole,1-ethyl-2-methyl

Kovats' RI, non-polar column, isothermal

Data compiled by: NIST Mass Spectrometry Data Center, William E. Wallace, director

Column type Capillary
Active phase OV-101
Column length (m) 30.
Carrier gas
Substrate
Column diameter (mm) 0.30
Phase thickness (μm) 0.20
Temperature (C) 110.
I 1050.
ReferenceGolovnya, Zhuravleva, et al., 1992
Comment MSDC-RI

References

Golovnya, Zhuravleva, et al., 1992
Golovnya, R.V.; Zhuravleva, I.L.; Sal'kova, M.A., Prediction of Retention Indexes of Alkylimadazoles Under Conditions of Capillary Gas Chromatography, J. Anal. Chem. USSR (Engl. Transl.), 1992, 7, 932-937. [all data]