p-Mentha-1,5,8-triene

Normal alkane RI, non-polar column, custom temperature program

Data compiled by: NIST Mass Spectrometry Data Center, William E. Wallace, director

Column type CapillaryCapillaryCapillaryCapillaryCapillary
Active phase DB-1DB-5HP-5 MSDB-5DB-1
Column length (m) 30.60.30.50.30.
Carrier gas HydrogenHeliumHeliumHeliumHe
Substrate
Column diameter (mm) 0.250.250.250.320.25
Phase thickness (μm) 0.251.000.250.250.25
Program 45 0C 3 0C/min -> 175 0C 15 0C/min -> 300 0C (10 min)40 0C 4 0C/min -> 230 0C 100 0C/min -> 260 0C (11.7 min)40 0C (5 min) 2 0C/min -> 250 0C (15 min) 10 0C/min -> 270 0C60 0C (1 min) 5 0C/min -> 160 0C 10 0C/min -> 250 0C45C => 3C/min => 175C => 15C/min => 300C (10min)
I 1074.1127.1111.1110.1074.
ReferenceAlbano, Lima, et al., 2012Miyazaki, Plotto, et al., 2011Formisano, Rigano, et al., 2007Nivinsliene, Butkiene, et al., 2007Figueiredo, Sim-Sim, et al., 2005
Comment MSDC-RI MSDC-RI MSDC-RI MSDC-RI MSDC-RI
Column type CapillaryCapillary
Active phase RTX-5DB-5
Column length (m) 30.30.
Carrier gas HeHe
Substrate
Column diameter (mm) 0.530.25
Phase thickness (μm) 1.50.25
Program 35 0C (2 min) 40 0C/min -> 60 0C (1 min) 6 0C/min -> 230 0C60C => 3C/min => 240C => 30C/min => 300C
I 1115.1111.
ReferenceMasanetz and Grosch, 1998Yusuf, Begum, et al., 1998
Comment MSDC-RI MSDC-RI

Kovats' RI, non-polar column, temperature ramp

View large format table.

Column type Active phase I Reference Comment
CapillaryDB-51113.Lucero, Fredrickson, et al., 200630. m/0.25 mm/0.25 μm, He, 3. K/min; Tstart: 60. C
CapillaryDB-51112.Barbosa, Paula, et al., 200530. m/0.25 mm/0.25 μm, He, 3. K/min, 240. C @ 15. min; Tstart: 60. C
CapillaryHP-5MS1111.Siani, Garrido, et al., 200430. m/0.32 mm/0.25 μm, He, 70. C @ 5. min, 3. K/min; Tend: 250. C
CapillaryMethyl Silicone1085.Palá-Paúl, Pérez-Alonso, et al., 200250. m/0.25 mm/0.25 μm, He, 4. K/min; Tstart: 70. C; Tend: 240. C
CapillarySE-301104.Palá-Paúl, Velasco-Negueruela, et al., 200225. m/0.22 mm/0.25 μm, He, 4. K/min; Tstart: 70. C; Tend: 220. C
CapillarySE-541110.Adams, 200030. m/0.26 mm/0.25 μm, 3. K/min; Tstart: 60. C; Tend: 246. C
CapillaryDB-51110.Adams, 199930. m/0.26 mm/0.25 μm, He, 3. K/min; Tstart: 60. C; Tend: 246. C

Van Den Dool and Kratz RI, non-polar column, temperature ramp

View large format table.

Column type Active phase I Reference Comment
CapillaryHP-5MS1113.Benkaci-Ali, Baaliouamer, et al., 200730. m/0.25 mm/0.25 μm, He, 60. C @ 8. min, 2. K/min, 250. C @ 30. min
CapillaryHP-51111.Quijano, Salamanca, et al., 200730. m/0.25 mm/0.25 μm, He, 50. C @ 4. min, 4. K/min, 250. C @ 10. min
CapillaryHP-5MS1110.Pino, Mesa, et al., 200530. m/0.25 mm/0.25 μm, He, 60. C @ 2. min, 4. K/min, 250. C @ 20. min
CapillaryHP-51113.Javidnia, Miri, et al., 200430. m/0.25 mm/0.25 μm, He, 3. K/min; Tstart: 60. C; Tend: 260. C
CapillaryDB-5MS1112.Mardarowicz, Wianowska, et al., 200430. m/0.25 mm/0.25 μm, He, 40. C @ 2. min, 4. K/min; Tend: 280. C
CapillaryHP-5MS1105.Tzakou, Vagias, et al., 200430. m/0.25 mm/0.25 μm, He, 3. K/min; Tstart: 60. C; Tend: 280. C
CapillaryDB-51123.Högnadóttir and Rouseff, 200330. m/0.32 mm/0.5 μm, 7. K/min, 265. C @ 5. min; Tstart: 40. C
CapillaryMS51111.Shao, Marriott, et al., 200325. m/0.25 mm/0.25 μm, 3. K/min; Tstart: 40. C; Tend: 180. C
CapillaryHP-51108.Skaltsa, Demetzos, et al., 200330. m/0.25 mm/0.25 μm, He, 60. C @ 5. min, 4. K/min; Tend: 280. C
CapillaryDB-51111.Economakis, Skaltsa, et al., 200230. m/0.25 mm/0.25 μm, 50. C @ 5. min, 3. K/min; Tend: 280. C
CapillaryHP-5MS1108.Skaltsa, Mavrommati, et al., 200130. m/0.25 mm/0.25 μm, He, 60. C @ 5. min, 4. K/min; Tend: 280. C
CapillaryDB-51114.Le Quere and Latrasse, 199060. m/0.32 mm/1. μm, He, 3. K/min; Tstart: 40. C; Tend: 220. C

Van Den Dool and Kratz RI, non-polar column, custom temperature program

View large format table.

Column type Active phase I Reference Comment
CapillaryHP-5MS1138.5Andriamaharavo, 201430. m/0.25 mm/0.25 μm, He; Program: 60C (1 min) => 5 C/min => 210C => 10 C/min => 280C (15 min)
CapillaryBPX-51125.Cardeal, da Silva, et al., 200630. m/0.25 mm/0.25 μm; Program: 35C(5min) => 3C/min => 210C => 40C/min => 240C (4min)
Capillary5 % Phenyl methyl siloxane1110.Sacchetti, Maietti, et al., 200530. m/0.32 mm/0.15 μm, He; Program: 45C => 1C/min => 100C => 5C/min => 250C (10min)
CapillarySE-541112.Tairu, Hofmann, et al., 199930. m/0.32 mm/0.25 μm, He; Program: 35C (2min) => 40C/min => 60C (2min) => 6C/min => 180C => 10C/min => 230C (5min)

Van Den Dool and Kratz RI, polar column, temperature ramp

View large format table.

Column type Active phase I Reference Comment
CapillaryCarbowax 20M1429.Verzera, Campisi, et al., 200560. m/0.25 mm/0.25 μm, He, 45. C @ 0.17 min, 2. K/min; Tend: 250. C
CapillaryAT-Wax1429.Pino, Marbot, et al., 200160. m/0.32 mm/0.25 μm, He, 65. C @ 10. min, 2. K/min, 250. C @ 60. min
CapillaryCP-Wax 52CB1429.Verzera, Campisi, et al., 200160. m/0.25 mm/0.25 μm, He, 45. C @ 0.17 min, 2. K/min; Tend: 250. C
CapillaryDB-Wax1391.Le Quere and Latrasse, 199030. m/0.32 mm/0.5 μm, He, 3. K/min; Tstart: 40. C; Tend: 220. C

Van Den Dool and Kratz RI, polar column, custom temperature program

View large format table.

Column type Active phase I Reference Comment
CapillaryDB-Wax1453.Radovic, Careri, et al., 200130. m/0.25 mm/0.25 μm; Program: 30C(8min) => 4C/min => 60C => 6C/min => 160C => 20C/min => 200C(1min)
CapillaryFFAP1375.Tairu, Hofmann, et al., 199930. m/0.32 mm/0.25 μm, He; Program: 35C (2min) => 40C/min => 60C (2min) => 6C/min => 180C => 10C/min => 230C (5min)

Normal alkane RI, non-polar column, temperature ramp

View large format table.

Column type Active phase I Reference Comment
CapillaryPolydimethyl siloxane with 5 % Ph1110.Priya, Prathapan, et al., 2012Helium, 5. K/min, 200. C @ 25. min; Column length: 30. m; Tstart: 80. C
CapillaryHP-51110.Bertoli, Lepnardi, et al., 201130. m/0.25 mm/0.25 μm, Helium, 3. K/min; Tstart: 60. C; Tend: 240. C
CapillaryHP-5 MS1109.Hammami, Kamoun, et al., 201130. m/0.25 mm/0.25 μm, Helium, 2. K/min; Tstart: 50. C; Tend: 180. C
CapillaryDB-51119.Yousefzadi, Heidari, et al., 2011Nitrogen, 60. C @ 1. min, 4. K/min, 250. C @ 10. min; Column length: 30. m; Column diameter: 0.25 mm
CapillaryDB-5 MS1112.Chalchat, Figueredo, et al., 201025. m/0.30 mm/0.25 μm, Helium, 3. K/min; Tstart: 50. C; Tend: 240. C
CapillaryHP-51130.Monsef-Esfahani, Miri, et al., 201030. m/0.25 mm/0.25 μm, Helium, 50. C @ 5. min, 3. K/min; Tend: 240. C
CapillaryDB-51109.Koba, Catherine, et al., 200930. m/0.25 mm/0.25 μm, Helium, 5. K/min; Tstart: 50. C; Tend: 250. C
CapillaryHP-5 MS1112.Zhao, Zeng, et al., 200930. m/0.25 mm/0.25 μm, Helium, 4. K/min; Tstart: 50. C; Tend: 280. C
CapillaryDB-51113.Jardin, Jham, et al., 200830. m/0.25 mm/0.25 μm, Nitrogen, 60. C @ 1. min, 3. K/min, 240. C @ 9. min
CapillaryDB-11112.Ghasempour, Shirinpour, et al., 200760. m/0.25 mm/0.25 μm, Nitrogen, 60. C @ 1. min, 4. K/min, 250. C @ 10. min
CapillaryZB-51115.Mohottalage, Tabacchi, et al., 200730. m/0.25 mm/0.25 μm, 60. C @ 5. min, 4. K/min, 220. C @ 20. min
CapillaryDB-11112.Reza, Ebrahim, et al., 200760. m/0.25 mm/0.25 μm, Nitrogen, 60. C @ 1. min, 4. K/min, 250. C @ 10. min
CapillaryHP-5 MS1111.Tsokou, Georgopoulos, et al., 200730. m/0.25 mm/0.25 μm, Helium, 3. K/min; Tstart: 60. C; Tend: 280. C
CapillaryHP-5MS1078.Tzakou, Bazos, et al., 200730. m/0.25 mm/0.25 μm, He, 3. K/min; Tstart: 60. C; Tend: 280. C
CapillaryDB-51111.Gohari, Hadjiakhoondi, et al., 200630. m/0.25 mm/0.25 μm, He, 60. C @ 2. min, 5. K/min; Tend: 240. C
CapillaryDB-51111.Gohari A.R., Hadjiakhoondi A., et al., 200630. m/0.25 mm/0.25 μm, He, 60. C @ 2. min, 5. K/min; Tend: 240. C
CapillaryDB-51112.Havlik, Kokoska, et al., 200630. m/0.25 mm/0.25 μm, He, 3. K/min, 250. C @ 10. min; Tstart: 50. C
CapillaryDB-51111.Javidnia, Miri, et al., 200630. m/0.25 mm/0.25 μm, Helium, 3. K/min; Tstart: 60. C; Tend: 260. C
CapillaryDB-11117.Pala-Paul J., Perez-Alonso M.J., et al., 200650. m/0.25 mm/0.25 μm, N2, 4. K/min; Tstart: 95. C; Tend: 240. C
CapillaryDB-51112.Pino, Marbot, et al., 200630. m/0.25 mm/0.25 μm, Hydrogen, 70. C @ 4. min, 4. K/min; Tend: 280. C
CapillaryDB-11112.Cégiéla-Carlioz, Bessière, et al., 200525. m/0.25 mm/0.25 μm, He, 50. C @ 3. min, 3. K/min; Tend: 250. C
CapillaryDB-51112.Chagonda and Chalchat, 200550. m/0.3 mm/0.25 μm, 2. K/min; Tstart: 60. C; Tend: 240. C
CapillaryHP-5MS1112.Sajjadi and Ghannadi, 200530. m/0.25 mm/0.25 μm, He, 4. K/min; Tstart: 60. C; Tend: 275. C
CapillaryHP-5MS1077.Tzakou, Bazos, et al., 200530. m/0.25 mm/0.25 μm, He, 3. K/min; Tstart: 60. C; Tend: 280. C
CapillaryDB-51084.Tzakou and Constantinidis, 200530. m/0.32 mm/0.25 μm, He, 3. K/min; Tstart: 60. C; Tend: 280. C
CapillaryHP-5 MS1110.Urdampilleta, Amat, et al., 200530. m/0.25 mm/0.25 μm, Helium, 3. K/min; Tstart: 60. C; Tend: 240. C
CapillarySE-541109.Kilic, Hafizoglu, et al., 200430. m/0.25 mm/0.25 μm, He, 60. C @ 5. min, 2. K/min; Tend: 260. C
CapillaryDB-11102.Palá-Paúl, García-Jiménez, et al., 200450. m/0.22 mm/0.25 μm, He, 4. K/min; Tstart: 70. C; Tend: 220. C
CapillaryDB-11104.Palá-Paúl, Velasco-Negueruela, et al., 200450. m/0.25 mm/0.25 μm, N2, 4. K/min; Tstart: 95. C; Tend: 240. C
CapillaryDB-51112.Masotti, Juteau, et al., 200350. m/0.2 mm/0.25 μm, He, 50. C @ 2. min, 3. K/min; Tend: 220. C
CapillaryOV-1011096.Orav, Kailas, et al., 200350. m/0.2 mm/0.5 μm, He, 2. K/min; Tstart: 50. C; Tend: 250. C
CapillaryDB-11118.Perez-Alonso, Velasco-Negueruela, et al., 200350. m/0.25 mm/0.25 μm, N2, 4. K/min; Tstart: 95. C; Tend: 240. C
CapillaryHP-51098.Pitarokili, Tzakou, et al., 200330. m/0.25 mm/0.25 μm, He, 3. K/min; Tstart: 60. C; Tend: 280. C
CapillarySE-301107.Iñigo, Palá-Paúl, et al., 200250. m/0.25 mm/0.25 μm, He, 4. K/min; Tstart: 70. C; Tend: 240. C
CapillaryDB-11089.Palá-Paúl, Pérez-Alonso, et al., 2002, 250. m/0.25 mm/0.25 μm, N2, 4. K/min; Tstart: 80. C; Tend: 225. C
CapillaryDB-51110.Zoghbi, Andrade, et al., 200230. m/0.25 mm/0.25 μm, He, 3. K/min; Tstart: 60. C; Tend: 240. C
CapillaryHP-51113.Gallori, Flamini, et al., 200130. m/0.25 mm/0.25 μm, N2, 60. C @ 10. min, 5. K/min; Tend: 220. C
CapillarySPB-51113.Doneanu and Anitescu, 199850. m/0.32 mm/0.25 μm, He, 3. K/min, 240. C @ 20. min; Tstart: 60. C
CapillaryDB-51111.Tellez, Estell, et al., 199730. m/0.25 mm/0.25 μm, Helium, 3. K/min; Tstart: 60. C; Tend: 240. C
CapillarySE-541107.Kollmannsberger, Nitz, et al., 199230. m/0.25 mm/0.25 μm, Hydrogen, 60. C @ 5. min, 2. K/min, 250. C @ 2. min

Normal alkane RI, polar column, temperature ramp

View large format table.

Column type Active phase I Reference Comment
CapillaryInnowax1383.Palá-Paúl, García-Jiménez, et al., 200450. m/0.2 mm/0.2 μm, He, 4. K/min; Tstart: 70. C; Tend: 220. C
CapillarySupelcowax-101387.Orav, Kailas, et al., 200350. m/0.2 mm/0.25 μm, He, 2. K/min; Tstart: 70. C; Tend: 230. C
CapillaryCarbowax 20M1391.Kollmannsberger, Nitz, et al., 199245. m/0.32 mm/1.0 μm, Hydrogen, 60. C @ 5. min, 2. K/min; Tend: 200. C

Normal alkane RI, polar column, custom temperature program

View large format table.

Column type Active phase I Reference Comment
CapillaryDB-Wax1392.Miyazaki, Plotto, et al., 201160. m/0.25 mm/0.50 μm, Helium; Program: 40 0C 4 0C/min -> 230 0C 100 0C/min -> 260 0C (11.7 min)
CapillaryBP-201441.Pontes, Marques, et al., 200730. m/0.25 mm/0.25 μm, He; Program: 50C(1min) => 2.5C/min => 100C => 2C/min => 180C => 15C/min => 220C
CapillaryHP-Innowax FSC1408.Erdurak, Coskun, et al., 200660. m/0.25 mm/0.25 μm, He; Program: 60C(10min) => 4C/min => 220C (10min) => 1C/min => 240C
CapillaryHP-Innowax FSC1408.Kürkçüoglu, Hüsnü Can Baser, et al., 200660. m/0.25 mm/0.25 μm, He; Program: 60C(10min) => 4C/min => 220C (10min) => 1C/min => 240C
CapillaryCarbowax 20M1429.Editorial paper, 2005Program: not specified
CapillaryHP-Innowax1408.Baser, Demirci, et al., 200260. m/0.25 mm/0.25 μm, He; Program: 60 0C (10 min) 4 K/min -> 220 0C (10 min) 1 K/min -> 240 0C
CapillaryInnowax1409.Baser, Özek, et al., 200060. m/0.25 mm/0.25 μm, He; Program: 60 0C (10 min) 4 K/min -> 220 0C (10 min) 1 K/min -> 240 0C
CapillaryInnowax1409.Baser, Tabanca, et al., 200060. m/0.25 mm/0.25 μm, He; Program: 60 0C (10 min) 4 K/min -> 220 0C (10 min) 1 K/min -> 240 0C
CapillaryCP-Wax 52CB1442.Luning, de Rijk, et al., 199450. m/0.32 mm/1.5 μm; Program: 40C => 2C/min => 150C => 10C/min => 250C

References

Albano, Lima, et al., 2012
Albano, S.M.; Lima, A.S.; Miguel, M.G.; Pedro, L.G.; Barroso, J.G.; Figueiredo, A.C., Antioxidant, anti-5-lipoxygenase and antiacetylcholinesterase activities of essential oils and decoction water of some aromatic plants, Rec. Nat. Prod., 2012, 6, 1, 35-48. [all data]

Miyazaki, Plotto, et al., 2011
Miyazaki, T.; Plotto, A.; Goodner, K.; Gmitter F.G., Distribution of aroma volatile compounds in tangerine hybrids and proposed inheritance, J. Sci. Food Agric., 2011, 91, 3, 449-460, https://doi.org/10.1002/jsfa.4205 . [all data]

Formisano, Rigano, et al., 2007
Formisano, C.; Rigano, D.; Napolitano, F.; Senatore, F.; Arnold, N.A.; Piozzi, F.; Rosselli, S., Volatile constituents of Calamintha ariganifolia Boiss. growing wild in Lebanon, Natural Product Communications, 2007, 2, 12, 1253-1256. [all data]

Nivinsliene, Butkiene, et al., 2007
Nivinsliene, O.; Butkiene, R.; Gudalevic, A.; Mockute, D.; Meskauskiene, V.; Grigaliunaite, B., Influence of urban environment on chemical composition of Tilia cordata essential oil, Chemija, 2007, 18, 1, 44-49. [all data]

Figueiredo, Sim-Sim, et al., 2005
Figueiredo, A.C.; Sim-Sim, M.; Costa, M.M.; Barroso, J.G.; Pedro, L.G.; Esquível, M.G.; Gutierres, F.; Lobo, C.; Fontinha, S., Comparison of the essential oil composition of four Plagiochila species: P. bifaria, P. maderensis, P. retrorsa and P. stricta, Flavour Fragr. J., 2005, 20, 6, 703-709, https://doi.org/10.1002/ffj.1627 . [all data]

Masanetz and Grosch, 1998
Masanetz, C.; Grosch, W., Key odorants of parsley leaves (Petroselinum crispum [Mill.] Nym. ssp. crispum) by odour-activity values, Flavour Fragr. J., 1998, 13, 2, 115-124, https://doi.org/10.1002/(SICI)1099-1026(199803/04)13:2<115::AID-FFJ706>3.0.CO;2-6 . [all data]

Yusuf, Begum, et al., 1998
Yusuf, M.; Begum, J.; Mondello, L.; Stagno d'Alcontres, I.S., Studies on the essential oil bearing plants of Bangladesh. Part VI. Composition of the oil of Ocimum gratissimum L., Flavour Fragr. J., 1998, 13, 3, 163-166, https://doi.org/10.1002/(SICI)1099-1026(199805/06)13:3<163::AID-FFJ714>3.0.CO;2-1 . [all data]