Hexanoic acid, 3-hydroxy-, methyl ester

Normal alkane RI, non-polar column, temperature ramp

Data compiled by: NIST Mass Spectrometry Data Center, William E. Wallace, director

Column type CapillaryCapillary
Active phase DB-1DB-1
Column length (m) 60.60.
Carrier gas HeHe
Substrate
Column diameter (mm) 0.320.32
Phase thickness (μm)
Tstart (C) 30.30.
Tend (C) 210.210.
Heat rate (K/min) 2.2.
Initial hold (min) 4.4.
Final hold (min)
I 1026.1029.
ReferenceTakeoka and Butter, 1989Takeoka and Butter, 1989
Comment MSDC-RI MSDC-RI

Van Den Dool and Kratz RI, polar column, custom temperature program

Data compiled by: NIST Mass Spectrometry Data Center, William E. Wallace, director

Column type Capillary
Active phase DB-Wax
Column length (m) 30.
Carrier gas H2
Substrate
Column diameter (mm) 0.25
Phase thickness (μm) 0.25
Program 60C (3min) => 2C/min => 220C => 5C/min => 250C (15min)
I 1640.
ReferenceBoulanger and Crouzet, 2001
Comment MSDC-RI

Normal alkane RI, polar column, custom temperature program

Data compiled by: NIST Mass Spectrometry Data Center, William E. Wallace, director

Column type Capillary
Active phase DB-Wax
Column length (m) 30.
Carrier gas He
Substrate
Column diameter (mm) 0.32
Phase thickness (μm) 0.5
Program 60C(2min) => 2C/min => 220C => 3C/min => 245C(20min)
I 1639.
ReferenceSelli, Cabaroglu, et al., 2003
Comment MSDC-RI

References

Takeoka and Butter, 1989
Takeoka, G.; Butter, R.G., Volatile constituents of pineapple (Ananas Comosus [L.] Merr.) in Flavor Chemistry. Trends and Developments, Teranishi,R.; Buttery,R.G.; Shahidi,F., ed(s)., American Chemical Society, Washington, DC, 1989, 223-237. [all data]