(benzene)3Ti2

Gas phase ion energetics data

Data compiled by: John E. Bartmess

Electron affinity determinations

EA (eV) Method Reference Comment
0.80 ± 0.10LPESZheng, Nilles, et al., 2005Vertical Detachment Energy: 0.90±0.075 eV

References

Zheng, Nilles, et al., 2005
Zheng, W.J.; Nilles, J.M.; Thomas, O.C.; Bowen, K.H., Photoelectron spectroscopy of titanium-benzene cluster anions, Chem. Phys. Lett., 2005, 401, 1-3, 266-270, https://doi.org/10.1016/j.cplett.2004.08.149 . [all data]