Copper,[N,N'-bis[(2-aminophenyl)methylene-1,2-ethanediaminato(2-)-N,N',N'',N''']-

Gas phase ion energetics data

Data compiled by: Sharon G. Lias, Rhoda D. Levin, and Sherif A. Kafafi

Ionization energy determinations

IE (eV) Method Reference
7.15 ± 0.11EIGilbert, Taylor, et al., 1973

References

Gilbert, Taylor, et al., 1973
Gilbert, W.C.; Taylor, L.T.; Dillard, J.G., Mass spectrometric study of polydentate Schiff base coordination compounds. I. Cobalt(II), nickel(II), and copper(II) complexes of salen and oaben, J. Am. Chem. Soc., 1973, 95, 2477. [all data]