Silane, methylenebis[trimethyl-

Condensed phase thermochemistry data

Data compiled by: Eugene S. Domalski and Elizabeth D. Hearing

Quantity Value Units Method Reference Comment
liquid123.3cal/mol*KN/AGuseinov and Karasharli, 1982
liquid123.30cal/mol*KN/AGuseinov, Karasharli, et al., 1975

Constant pressure heat capacity of liquid

Cp,liquid (cal/mol*K) Temperature (K) Reference Comment
85.44298.15Guseinov and Karasharli, 1982T = 12 to 300 K.
85.449298.15Guseinov, Karasharli, et al., 1975T = 10 to 300 K. Data given graphically.

References

Guseinov and Karasharli, 1982
Guseinov, Z.A.; Karasharli, K.A., Heat capacity and thermodynamic functions of hexamethyldisilylmethane, Azerb. Khim. Zhur., 1982, (4), 107-109. [all data]

Guseinov, Karasharli, et al., 1975
Guseinov, Z.A.; Karasharli, K.A.; Dzhafarov, O.I.; Nurullaev, G.G.; Nametkin, N.S.; Gusel'nikov, L.E.; Volnina, F.A.; Burdasov, E.N.; Vdovin, V.M., Thermodynamic parameters of some cyclic and bridging carbosilanes, Dokl.Akad. Nauk, 1975, SSSR 222, 1369-1372. [all data]