Pyridine, 2-(2-phenylethyl)-

Normal alkane RI, non-polar column, isothermal

View large format table.

Column type Active phase Temperature (C) I Reference Comment
PackedSE-30220.1531.Xiaoyun, Xiammou, et al., 1991Column length: 2. m

References

Xiaoyun, Xiammou, et al., 1991
Xiaoyun, J.; Xiammou, Z.; Yijian, G., Kovats retention indices of some alkylquinolines, alkylisoquinolines, phenylalkyl- and phenoxyalkylpyridines, Chin, J, Chromatogr., 1991, 9, 3, 187-191. [all data]