Bicyclo[2.2.2]oct-2-ene, 5-ethenyl-, (1α,4α,5β)-

Gas phase thermochemistry data

Data compiled by: Hussein Y. Afeefy, Joel F. Liebman, and Stephen E. Stein

Quantity Value Units Method Reference Comment
Δfgas107. ± 4.2kJ/molKinVan Mele, Boon, et al., 1986
Δfgas105.kJ/molKinHuybrechts, Hubin, et al., 1982

References

Van Mele, Boon, et al., 1986
Van Mele, B.; Boon, G.; Huybrechts, G., Gas-phase kinetic and thermochemical data for endo- and exo-5-monosubstituted bicyclo[2.2.2]oct-2-enes, Int. J. Chem. Kinet., 1986, 18, 537-545. [all data]

Huybrechts, Hubin, et al., 1982
Huybrechts, G.; Hubin, Y.; Narmon, M.; Van Mele, B., Kinetics of the thermal reactions of bicyclo[4.2.2]deca-3,7-diene and endo- and exo-5-vinylbicyclo[2.2.2]oct-2-ene in the gas phase, Int. J. Chem. Kinet., 1982, 14, 251-257. [all data]