Hexyl carbamate

Phase change data

Data compiled by: William E. Acree, Jr., James S. Chickos

Enthalpy of sublimation

ΔsubH (kJ/mol) Temperature (K) Method Reference
96.2 ± 0.8291. - 314.GSDavies and Jones, 1959

References

Davies and Jones, 1959
Davies, Mansel; Jones, A. Hamilton, Lattice energies of some n-methyl amides and of some carbamates, Trans. Faraday Soc., 1959, 55, 1329, https://doi.org/10.1039/tf9595501329 . [all data]