p-Chloranil potassium

Phase change data

Data compiled by: Eugene S. Domalski and Elizabeth D. Hearing

Enthalpy of phase transition

ΔHtrs (kJ/mol) Temperature (K) Initial Phase Final Phase Reference Comment
2.796260.01crystaline, IIcrystaline, IKosaki, Sorai, et al., 1977S obtained by summation of experimental Cp/T data.

Entropy of phase transition

ΔStrs (J/mol*K) Temperature (K) Initial Phase Final Phase Reference Comment
11.06260.01crystaline, IIcrystaline, IKosaki, Sorai, et al., 1977S

References

Kosaki, Sorai, et al., 1977
Kosaki, A.; Sorai, M.; Suga, H.; Seki, S., Heat capacity of potassium p-chloranil anion radical salt between 13 and 330K, Bull. Chem. Soc. Japan, 1977, 50, 810-816. [all data]