1,1'-Biphenyl, 2-iodo-

Gas phase ion energetics data

Data compiled by: Sharon G. Lias, Rhoda D. Levin, and Sherif A. Kafafi

Ionization energy determinations

IE (eV) Method Reference
8.20 ± 0.02PEMaier and Turner, 1972

References

Maier and Turner, 1972
Maier, J.P.; Turner, D.W., Steric inhibition of resonance studied by molecular photoelectron spectroscopy. Part I. Biphenyls, Faraday Discuss. Chem. Soc., 1972, 54, 149. [all data]