Rh7

Gas phase ion energetics data

Data compiled by: John E. Bartmess

Electron affinity determinations

EA (eV) Method Reference Comment
2.100 ± 0.050LPESBeltran, Zamudio, et al., 2013Vertical Detachment Energy: 2.2±0.05 eV

References

Beltran, Zamudio, et al., 2013
Beltran, M.R.; Zamudio, F.B.; Chauhan, V.; Sen, P.; Wang, H.P.; Ko, Y.J.; Bowen, K., Ab initio and anion photoelectron studies of Rh-n (n=1-9) clusters, Eur. Phys. J. D, 2013, 67, 3, 63, https://doi.org/10.1140/epjd/e2013-30547-2 . [all data]