(1R,3S,4S)-1,3-Dimethyl-3-(4-methylpent-3-en-1-yl)-2-oxabicyclo[2.2.2]oct-5-ene

Normal alkane RI, polar column, custom temperature program

Data compiled by: NIST Mass Spectrometry Data Center, William E. Wallace, director

Column type CapillaryCapillary
Active phase Innowax FSCHP-Innowax FSC
Column length (m) 60.60.
Carrier gas HeHe
Substrate
Column diameter (mm) 0.250.25
Phase thickness (μm) 0.250.25
Program 60C(10min) => 4C/min => 220C (10min) => 1C/min => 240C60C(10min) => 4C/min => 220C(10min) => 1C/min => 240C
I 1727.1727.
ReferenceTosun, Kürkcüoglu, et al., 2006Tabanca, Demirci, et al., 2005
Comment MSDC-RI MSDC-RI

References

Tosun, Kürkcüoglu, et al., 2006
Tosun, A.; Kürkcüoglu, M.; Dogan, E.; Duman, H.; Baser, K.H.C., Essential oil composition of Seseli petraeum M. Bieb. and Seseli andronakii Woron. growing in Turkey, Flavour Fragr. J., 2006, 21, 2, 257-259, https://doi.org/10.1002/ffj.1572 . [all data]

Tabanca, Demirci, et al., 2005
Tabanca, N.; Demirci, B.; Kirimer, N.; Baser, K.H.C.; Bedir, E.; Khand, I.A.; Wedge, D.E., Gas chromatographic-mass spectrometric analysis of essential oils from Pimpinella aurea, Pimpinella corymbosa, Pimpinella peregrina and Pimpinella puberula gathered from Eastern and Southern Turkey, J. Chromatogr. A, 2005, 1097, 1-2, 192-198, https://doi.org/10.1016/j.chroma.2005.10.047 . [all data]