barium sulphide

Gas phase thermochemistry data

Quantity Value Units Method Reference Comment
Δfgas37.78kJ/molReviewChase, 1998Data last reviewed in September, 1977
Quantity Value Units Method Reference Comment
gas,1 bar248.86J/mol*KReviewChase, 1998Data last reviewed in September, 1977

Gas Phase Heat Capacity (Shomate Equation)

Cp° = A + B*t + C*t2 + D*t3 + E/t2
H° − H°298.15= A*t + B*t2/2 + C*t3/3 + D*t4/4 − E/t + F − H
S° = A*ln(t) + B*t + C*t2/2 + D*t3/3 − E/(2*t2) + G
    Cp = heat capacity (J/mol*K)
    H° = standard enthalpy (kJ/mol)
    S° = standard entropy (J/mol*K)
    t = temperature (K) / 1000.

View plot Requires a JavaScript / HTML 5 canvas capable browser.

View table.

Temperature (K) 298. - 3000.3000. - 6000.
A 35.10736-683.4271
B 6.630134352.7480
C -5.977430-58.02957
D 1.8512163.216220
E -0.0948011004.491
F 26.752661400.531
G 289.0897317.8924
H 37.7820237.78202
ReferenceChase, 1998Chase, 1998
Comment Data last reviewed in September, 1977 Data last reviewed in September, 1977

Condensed phase thermochemistry data

Quantity Value Units Method Reference Comment
Δfsolid-463.59kJ/molReviewChase, 1998Data last reviewed in September, 1977
Quantity Value Units Method Reference Comment
solid78.35J/mol*KReviewChase, 1998Data last reviewed in September, 1977

Solid Phase Heat Capacity (Shomate Equation)

Cp° = A + B*t + C*t2 + D*t3 + E/t2
H° − H°298.15= A*t + B*t2/2 + C*t3/3 + D*t4/4 − E/t + F − H
S° = A*ln(t) + B*t + C*t2/2 + D*t3/3 − E/(2*t2) + G
    Cp = heat capacity (J/mol*K)
    H° = standard enthalpy (kJ/mol)
    S° = standard entropy (J/mol*K)
    t = temperature (K) / 1000.

View plot Requires a JavaScript / HTML 5 canvas capable browser.

View table.

Temperature (K) 298. - 3000.
A 49.35710
B 9.299091
C -0.991007
D 0.175505
E -0.245622
F -479.5420
G 133.9690
H -463.5870
ReferenceChase, 1998
Comment Data last reviewed in September, 1977

References

Chase, 1998
Chase, M.W., Jr., NIST-JANAF Themochemical Tables, Fourth Edition, J. Phys. Chem. Ref. Data, Monograph 9, 1998, 1-1951. [all data]