2,3-dimethylbutyraldehyde

Phase change data

Data compiled by: Thermodynamics Research Center, NIST Boulder Laboratories, Chris Muzny director

Quantity Value Units Method Reference Comment
Tboil384.65KN/APomerantz, Mears, et al., 1949Uncertainty assigned by TRC = 1.5 K
Tboil386.15KN/ABarnes and Budde, 1946Uncertainty assigned by TRC = 3. K
Tboil380.15KN/AMeunier, 1936Uncertainty assigned by TRC = 4. K
Tboil385.15KN/AReindel and Kipphan, 1932Uncertainty assigned by TRC = 3. K

In addition to the Thermodynamics Research Center (TRC) data available from this site, much more physical and chemical property data is available from the following TRC products:

References

Pomerantz, Mears, et al., 1949
Pomerantz, P.; Mears, T.W.; Howard, F.L., Separation and Identification of the Major C1 to C10 Components of Triptene Residue, J. Res. Natl. Bur. Stand. (U. S.), 1949, 42, 617-32. [all data]

Barnes and Budde, 1946
Barnes, R.A.; Budde, W.M., 2,3-dimethylbutanal and 2-ethyl-3-methylbutanal, J. Am. Chem. Soc., 1946, 68, 2339. [all data]

Meunier, 1936
Meunier, V.C., , Ph.D. Thesis, Penn. State Univ., Univ. Park, 1936. [all data]

Reindel and Kipphan, 1932
Reindel; Kipphan, Justus Liebigs Ann. Chem., 1932, 493, 181. [all data]