Cyclohexane, 1,1-dichloro-

Phase change data

Data compiled as indicated in comments:
BS - Robert L. Brown and Stephen E. Stein
TRC - Thermodynamics Research Center, NIST Boulder Laboratories, Chris Muzny director
AC - William E. Acree, Jr., James S. Chickos

Quantity Value Units Method Reference Comment
Ttriple236.59KN/AKabo, Kozyro, et al., 1999Crystal phase 1 phase; Uncertainty assigned by TRC = 0.1 K; TRC

Reduced pressure boiling point

Tboil (K) Pressure (bar) Reference Comment
335.20.027Weast and Grasselli, 1989BS

Enthalpy of vaporization

ΔvapH (kJ/mol) Temperature (K) Method Reference Comment
43.5350.AStephenson and Malanowski, 1987Based on data from 335. - 444. K.; AC

Enthalpy of fusion

ΔfusH (kJ/mol) Temperature (K) Reference Comment
1.47236.Kabo, Kozyro, et al., 1999, 2AC

In addition to the Thermodynamics Research Center (TRC) data available from this site, much more physical and chemical property data is available from the following TRC products:

Normal alkane RI, non-polar column, temperature ramp

View large format table.

Column type Active phase I Reference Comment
CapillaryOV-101978.Zenkevich, Eliseenkov, et al., 200925. m/0.20 mm/0.25 μm, Nitrogen, 6. K/min; Tstart: 60. C; Tend: 240. C
CapillaryOV-101978.Zenkevich, Eliseenkov, et al., 200925. m/0.20 mm/0.25 μm, Nitrogen, 6. K/min; Tstart: 60. C; Tend: 240. C
CapillaryOV-101978.Zenkevich, Eliseenkov, et al., 200925. m/0.20 mm/0.25 μm, Nitrogen, 6. K/min; Tstart: 60. C; Tend: 240. C
CapillaryOV-101978.Zenkevich, Eliseenkov, et al., 200925. m/0.20 mm/0.25 μm, Nitrogen, 6. K/min; Tstart: 60. C; Tend: 240. C
CapillaryOV-101981.Zenkevich, Eliseenkov, et al., 200925. m/0.20 mm/0.25 μm, Nitrogen, 6. K/min; Tstart: 60. C; Tend: 240. C
CapillaryOV-101983.Zenkevich, Eliseenkov, et al., 200925. m/0.20 mm/0.25 μm, Nitrogen, 6. K/min; Tstart: 60. C; Tend: 240. C

References

Kabo, Kozyro, et al., 1999
Kabo, G.J. (see Kabo; Kozyro, A.A.; Frenkel, M. (see frenke ml); Blokhin, A.V., Solid Phase Transitions of the Cyclohexane Derivatives and the Model of Energy States of Molecules in Plastic Crystals, Mol. Cryst. Liq. Cryst., 1999, 326, 333-5. [all data]

Weast and Grasselli, 1989
CRC Handbook of Data on Organic Compounds, 2nd Editon, Weast,R.C and Grasselli, J.G., ed(s)., CRC Press, Inc., Boca Raton, FL, 1989, 1. [all data]

Stephenson and Malanowski, 1987
Stephenson, Richard M.; Malanowski, Stanislaw, Handbook of the Thermodynamics of Organic Compounds, 1987, https://doi.org/10.1007/978-94-009-3173-2 . [all data]

Kabo, Kozyro, et al., 1999, 2
Kabo, G.J.; Kozyro, A.A.; Frenkel, M.; Blokhin, A.V., Solid Phase Transitions of the Cyclohexane Derivatives and the Model of Energy States of Molecules in Plastic Crystals, Molecular Crystals and Liquid Crystals Science and Technology. Section A. Molecular Crystals and Liquid Crystals, 1999, 326, 1, 333-355, https://doi.org/10.1080/10587259908025424 . [all data]

Zenkevich, Eliseenkov, et al., 2009
Zenkevich, I.G.; Eliseenkov, E.V.; Kasatochkin, A.N., Chromatographic Identification of Cyclohexane Chlorination Products by an Additive Scheme for the Prediction of Retention Indices, Chromatographia, 2009, 70, 5/6, 839-849, https://doi.org/10.1365/s10337-009-1213-x . [all data]