Silphiperfola-4,7(14)-diene

Van Den Dool and Kratz RI, non-polar column, custom temperature program

View large format table.

Column type Active phase I Reference Comment
CapillaryHP-5MS1362.5Andriamaharavo, 201430. m/0.25 mm/0.25 μm, He; Program: 60C (1 min) => 5 C/min => 210C => 10 C/min => 280C (15 min)

Normal alkane RI, non-polar column, temperature ramp

View large format table.

Column type Active phase I Reference Comment
CapillaryDB-51361.Kowalski, 200530. m/0.25 mm/0.25 μm, Helium, 35. C @ 2. min, 4. K/min; Tend: 280. C

References

Andriamaharavo, 2014
Andriamaharavo, N.R., Retention Data. NIST Mass Spectrometry Data Center., NIST Mass Spectrometry Data Center, 2014. [all data]

Kowalski, 2005
Kowalski, R., Analysis of lipophylic fraction from leaves, inflorescences and rhizomes of Siphium perfoliatum L., Acta Soc. Botanicorum Poloniae, 2005, 74, 1, 5-10, https://doi.org/10.5586/asbp.2005.001 . [all data]