2-Propen-1-ol, 3-phenyl-, acetate, (E)-

Van Den Dool and Kratz RI, non-polar column, temperature ramp

Data compiled by: NIST Mass Spectrometry Data Center, William E. Wallace, director

Column type Capillary
Active phase DB-1
Column length (m) 30.
Carrier gas N2
Substrate
Column diameter (mm) 0.25
Phase thickness (μm) 0.25
Tstart (C) 50.
Tend (C) 200.
Heat rate (K/min) 5.
Initial hold (min)
Final hold (min) 0.
I 1439.
ReferenceBoyom, Assembe, et al., 2003
Comment MSDC-RI

Kovats' RI, polar column, temperature ramp

Data compiled by: NIST Mass Spectrometry Data Center, William E. Wallace, director

Column type Capillary
Active phase Supelcowax-10
Column length (m) 60.
Carrier gas He
Substrate
Column diameter (mm) 0.25
Phase thickness (μm)
Tstart (C) 35.
Tend (C) 200.
Heat rate (K/min) 3.
Initial hold (min) 5.
Final hold (min) 20.
I 2182.
ReferenceWong and Teng, 1994
Comment MSDC-RI

References

Boyom, Assembe, et al., 2003
Boyom, F.F.; Assembe, E.Z.; Zollo, P.H.A.; Agnaniet, H.; Menut, C.; Bessière, J.M., Aromatic plants of tropical central Africa. Part XLII. Volatile components from Antidesma laciniatum Muell. Arg. Var. laciniatum growing in Cameroon, Flavour Fragr. J., 2003, 18, 5, 451-453, https://doi.org/10.1002/ffj.1251 . [all data]