Pb11

Gas phase ion energetics data

Data compiled by: John E. Bartmess

Electron affinity determinations

EA (eV) Method Reference Comment
2.340 ± 0.080LPESNegishi, Kawamata, et al., 2000EA is threshold energy, upper limit to true EA
2.550 ± 0.088LPESGanteför, Gausa, et al., 1989EA: sharp threshold, ≤EA(adiabatic).

References

Negishi, Kawamata, et al., 2000
Negishi, Y.; Kawamata, H.; Nakajima, A.; Kaya, K., Photoelectron spectroscopy of tin and lead cluster anions: application of halogen-doping method, J. Electron Spectros. Rel. Phenom., 2000, 106, 2-3, 117-125, https://doi.org/10.1016/S0368-2048(99)00070-5 . [all data]

Ganteför, Gausa, et al., 1989
Ganteför, G.; Gausa, M.; Meiwes-Broer, K.H.; Lutz, H.O., Photoemission from Tin and Lead Clusters Anions, Z. Phys. D, 1989, 14, 1-4, 405, https://doi.org/10.1007/BF01426983 . [all data]